program: Gaussian 09
title: 000231485
version: EM64L-G09RevD.01
frameworkgroup: C1[X(C13H17NO4)]
method: RPBEPBE
basis: SDD
operation: Freq
keyword: #p
keyword: freq=noraman
keyword: PBEPBE/SDD
title: #p freq=noraman PBEPBE/SDD
converged: YES YES NO NO
title: Mulliken charges:
elementType: O O O O N C C C C C C C C C C C C C H H H H H H H H H H H H H H H H H
charge: -0.212301 -0.234251 -0.204292 -0.190561 0.116020 0.301568 -0.377167 -0.401219 -0.411350 0.062261 -0.614172 -0.700724 0.502320 -0.376592 -0.440295 -0.223201 -0.224762 -0.248038 0.275862 0.185978 0.190730 0.274887 0.240591 0.210098 0.194106 0.229169 0.214549 0.242920 0.225391 0.228394 0.271189 0.222749 0.224261 0.221277 0.224604
chargesum: 0.00000
title: Mulliken charges with hydrogens summed into heavy atoms:
elementType: O O O O N C C C C C C C C C C C C C
charge: -0.212301 -0.234251 -0.204292 -0.190561 0.116020 0.301568 0.084673 0.064399 0.039339 0.256367 -0.170455 -0.004019 0.502320 -0.105403 -0.217546 0.001061 -0.003485 -0.023434
polarizability: 1.73104135e+02 1.33518824e+01 1.52138701e+02 1.65492320e+01 -7.73003528e+00 1.31270534e+02
1716.lowfreq: -7.4287 -3.1032 -0.0005 0.0005 0.0008 6.6674 17.6817 28.5774 40.3371
frequency: 14.9797 28.5294 40.1048 59.8659 72.7797 99.0170 157.4904 171.4992 183.7923 200.4076 226.4435 253.8918 296.0289 311.8300 323.3804 352.5341 371.5048 403.4885 435.8195 458.1640 477.6518 511.4519 520.4977 541.3892 599.7010 616.7536 668.1265 686.9509 704.7142 750.4366 763.4572 766.1086 778.1581 790.1025 852.9148 861.3610 902.0919 907.8936 929.8981 954.1505 969.5607 975.8709 979.1520 990.5941 996.1649 1010.4283 1028.4382 1055.5030 1067.0687 1083.7041 1088.5639 1102.6329 1144.0252 1170.9051 1191.0308 1195.4946 1214.3411 1216.3122 1224.4669 1242.4368 1255.4892 1306.1918 1317.9117 1322.0705 1336.3733 1346.5741 1355.8950 1366.3769 1374.9213 1384.8625 1403.9583 1411.0886 1439.3829 1440.3446 1446.5158 1451.4851 1465.9400 1483.8809 1485.4357 1486.4616 1593.8302 1616.3930 2870.7394 2939.6921 2948.4356 2992.0285 2993.7169 2999.7849 3047.6102 3057.8061 3088.6319 3094.0858 3111.7276 3112.7049 3123.1635 3124.7472 3138.4351 3154.8398 3169.1757
redmass: 3.9767 6.3819 5.2927 8.3466 2.7066 4.7375 3.7505 7.2909 5.4658 1.7829 3.5467 2.3502 2.2286 2.5253 2.2461 3.5451 2.3798 2.8213 3.6819 3.7912 3.5410 4.8998 4.6003 5.6649 6.2464 6.2633 4.4562 3.7699 1.6491 2.9539 3.1739 5.9882 1.4595 2.9313 1.2512 2.7845 1.8294 1.7738 2.2734 2.6965 7.6046 1.4109 2.0983 4.3374 1.5066 2.5954 2.2310 1.9010 2.0642 2.1037 2.0773 3.1066 2.3909 1.0546 1.1770 1.6447 2.1898 2.0055 2.7969 1.1991 1.2393 1.4710 1.3819 1.2400 1.3010 1.5420 1.3075 1.4104 1.3666 5.0869 1.7653 2.1405 1.7437 1.1713 1.0900 1.2445 1.1071 1.0607 2.2869 1.0469 6.0498 6.1017 1.0827 1.0691 1.0697 1.0580 1.0387 1.0617 1.1012 1.0993 1.0994 1.1008 1.0938 1.0865 1.0927 1.0874 1.0931 1.0974 1.0981
irintensity: 0.1457 1.2835 2.4593 0.1775 0.2001 0.1074 1.5278 1.3682 2.1162 0.4202 1.4835 1.0751 1.4060 4.5908 0.0852 3.1362 8.8807 0.2365 1.7350 1.5001 6.7825 4.1547 8.2465 7.7356 6.1593 0.2256 11.1836 3.8051 75.0838 18.6022 29.5868 19.8000 11.2577 30.5545 1.1133 15.8368 11.0401 4.2682 2.5828 41.8858 26.3538 0.5701 22.7817 0.9789 3.3543 25.5154 9.9027 0.0267 27.1518 52.2777 67.1945 30.9533 13.3207 0.1848 0.6940 5.9946 7.5935 28.4267 19.1414 3.3519 22.0674 11.1173 1.5005 4.6481 1.0685 11.6828 5.8235 30.1816 0.9686 0.1464 100.1361 58.4752 5.0477 1.6924 10.6204 17.3556 9.2239 16.7038 20.8568 11.8703 0.6968 6.3141 89.2191 11.5337 109.7397 29.8396 15.9083 32.8374 4.8349 11.1258 32.2837 28.1827 3.2938 8.0811 4.1648 3.8175 34.7737 31.5698 8.2668
temp: 298.150 k
press: 1.00000 atm
elementType: 8 8 8 8 7 6 6 6 6 6 6 6 6 6 6 6 6 6 1 1 1 1 1 1 1 1 1 1 1 1 1 1 1 1 1
symmnumber: 1
zpe: 741988.3 jmol-1
zpe.correction: 0.282608 hartree
zpe.thermalcorrener: 0.299562 hartree
zpe.thermalcorrenthalpy: 0.300506 hartree
zpe.thermalcorrgfe: 0.235873 hartree
zpe.sumelectzpe: -859.761130 hartree
zpe.sumelectthermal: -859.744176 hartree
zpe.sumelectthermalent: -859.743232 hartree
zpe.sumelectthermalfe: -859.807865 hartree
dipole: -3.8670 -4.4106 -0.0871
dipole: 5.8664
quadrupole: -90.5536 -104.1362 -109.7373
quadrupole: 7.1962 2.8788 -3.0244
quadrupole: 10.9221 -2.6605 -8.2616 7.1962 2.8788 -3.0244
hfenergy: -860.0437383 hartree
pointgroup: C01[X(C13H17N1O4)]
dipole: 1.5819402 -1.6730765 -0.1588131 debye
polarizability: 170.6862113|-16.9994183|147.498153|16.8933562|9.8451114|138.3290049 unknown
InChI: InChI=1S/C13H17NO4/c1-2-13(14(15)16)9-17-12(18-10-13)8-11-6-4-3-5-7-11/h3-7,12H,2,8-10H2,1H3
charge 0 multiplicity 1
35 atoms
O  0.33485 -0.878484 -1.216787
O  0.449595 -1.211499 1.169327
O  1.944266 2.138192 -0.823291
O  1.484381 1.746056 1.368573
N  1.867765 1.370355 0.204502
C  2.371171 -0.098849 0.013114
C  1.778364 -0.646447 -1.30986
C  1.897641 -0.972068 1.194636
C  3.920962 -0.016479 -0.091686
C  0.019164 -1.781362 -0.11326
C  -1.491868 -2.017356 -0.071407
C  4.635239 0.577868 1.141339
C  -2.366732 -0.76772 -0.095493
C  -2.258938 0.238188 0.900409
C  -3.340501 -0.614008 -1.113754
C  -3.104954 1.368216 0.871559
C  -4.192186 0.514233 -1.141255
C  -4.077121 1.510769 -0.146085
H  1.916604 0.07633 -2.127038
H  2.308466 -1.596075 -1.547415
H  2.446674 -1.938771 1.136467
H  2.094499 -0.489426 2.16123
H  4.166756 0.580673 -0.99018
H  4.291578 -1.043944 -0.275233
H  0.578686 -2.739206 -0.265826
H  -1.685432 -2.611321 0.842899
H  -1.744601 -2.658623 -0.93532
H  4.298241 1.60736 1.355058
H  4.472296 -0.028918 2.049674
H  5.723408 0.614882 0.957845
H  -1.500229 0.139518 1.682544
H  -3.42892 -1.379547 -1.89504
H  -3.00258 2.14054 1.642467
H  -4.937836 0.615629 -1.938273
H  -4.732806 2.388793 -0.16544
