program: Gaussian 09
title: 000231481
version: EM64L-G09RevD.01
frameworkgroup: C1[X(C11H12Br2O3)]
method: RPBEPBE
basis: SDD
operation: Freq
keyword: #p
keyword: freq=noraman
keyword: PBEPBE/SDD
title: #p freq=noraman PBEPBE/SDD
converged: YES YES NO NO
title: Mulliken charges:
elementType: Br Br O O O C C C C C C C C C C C H H H H H H H H H H H H
charge: -0.015261 -0.000341 -0.266473 -0.265757 -0.280487 -0.516795 0.396907 -0.410334 0.176702 -0.490432 0.180045 0.188304 -0.472149 -0.642428 -0.201392 -0.535443 0.263221 0.252976 0.319923 0.264366 0.265832 0.308712 0.300218 0.239066 0.240198 0.223878 0.249001 0.227945
chargesum: 0.00000
title: Mulliken charges with hydrogens summed into heavy atoms:
elementType: Br Br O O O C C C C C C C C C C C
charge: -0.015261 -0.000341 -0.266473 -0.265757 -0.280487 -0.000598 0.396907 -0.090411 0.176702 -0.226067 0.180045 0.188304 -0.206317 -0.033497 0.277871 0.165381
polarizability: 2.19716954e+02 6.32851417e+00 1.46800968e+02 2.13743856e+01 -1.07543398e+01 1.30421881e+02
1716.lowfreq: -52.8979 -10.8090 -4.8694 0.0003 0.0004 0.0004 3.1211 18.4633 30.3414
frequency: -52.8591 18.4158 30.3041 43.7573 70.9328 83.7989 119.3099 139.8534 154.5278 168.8983 212.8000 230.7657 262.0228 288.0339 317.9483 333.3176 355.7611 381.9500 444.8380 458.2251 487.2330 551.2209 588.9897 626.6969 662.9894 677.0902 714.9001 725.2634 759.4411 816.0068 829.3524 844.4848 866.1347 874.1918 886.0175 956.2907 977.3528 998.2245 1033.1600 1065.4242 1066.6117 1107.1774 1112.6166 1120.0620 1145.9314 1153.7897 1162.7075 1178.7227 1217.5754 1237.2695 1256.2701 1290.8625 1308.5355 1326.7834 1363.2224 1405.4479 1412.8996 1417.7462 1444.6009 1460.2100 1467.8052 1469.6885 1481.5582 1491.8145 1620.5200 1628.4577 2963.5228 3013.1429 3022.8207 3053.6182 3061.8791 3075.2513 3093.3188 3094.3844 3127.8427 3150.2941 3162.5313 3190.6524
redmass: 2.3539 9.7313 7.8078 6.1883 9.4529 3.8304 11.9236 6.1210 3.9670 5.1481 3.9969 1.5515 3.1392 3.0502 3.2855 3.6679 5.3836 4.2027 3.7569 5.8359 5.1565 3.7093 4.2919 4.6881 7.3749 9.4976 3.9284 6.0571 5.2248 3.8824 1.5963 8.2492 1.4885 1.9446 1.6182 6.8721 5.4661 3.3812 5.3435 1.4672 2.0818 1.1990 1.2552 1.0379 2.0783 1.4200 1.8266 1.7686 1.1982 1.3185 1.2326 6.1580 1.3100 1.3307 1.3177 2.8109 5.3889 1.1462 1.3454 1.1617 1.0649 1.2880 1.2265 1.6903 7.9755 9.5839 1.0327 1.0539 1.0606 1.1043 1.0571 1.0902 1.1186 1.0992 1.0998 1.1084 1.0931 1.0923
irintensity: 13.3437 0.0899 0.4318 0.2486 0.6330 3.9937 1.5276 2.1009 3.8298 2.2515 1.0858 0.2382 1.0741 3.7044 6.0315 4.0125 5.9053 1.4670 16.1475 10.0415 23.9982 17.1345 6.0271 28.8565 2.3173 0.1639 1.6607 7.3904 2.4485 15.9514 31.4619 33.4202 24.8082 22.4085 34.8068 37.5009 168.6643 2.7099 31.3559 5.2637 1.9983 4.9918 0.5901 0.0677 31.4214 41.0479 173.4296 66.7326 27.0929 6.0980 20.6745 127.9643 17.0397 2.8619 0.7307 58.1628 5.9864 13.2397 5.7658 31.1104 27.0669 154.3134 33.5106 86.8632 20.8776 12.4906 63.8999 129.6563 11.7108 41.2541 6.3156 1.0222 31.5843 5.0561 17.2490 1.9932 1.7759 1.2928
temp: 298.150 k
press: 1.00000 atm
elementType: 35 35 8 8 8 6 6 6 6 6 6 6 6 6 6 6 1 1 1 1 1 1 1 1 1 1 1 1
symmnumber: 1
zpe: 546777.6 jmol-1
zpe.correction: 0.208257 hartree
zpe.thermalcorrener: 0.224006 hartree
zpe.thermalcorrenthalpy: 0.224950 hartree
zpe.thermalcorrgfe: 0.161202 hartree
zpe.sumelectzpe: -677.722344 hartree
zpe.sumelectthermal: -677.706594 hartree
zpe.sumelectthermalent: -677.705650 hartree
zpe.sumelectthermalfe: -677.769398 hartree
dipole: 5.1655 2.0188 -1.4706
dipole: 5.7376
quadrupole: -113.4284 -106.5773 -110.8887
quadrupole: 0.2938 4.3616 -8.5955
quadrupole: -3.1302 3.7208 -0.5906 0.2938 4.3616 -8.5955
hfenergy: -677.9306005 hartree
pointgroup: C01 [X(C11H12Br2O3)]
dipole: 1.9192397 1.1883139 -0.0071863 debye
polarizability: 223.8476313|-1.8931752|147.5069635|9.447954|10.9010299|125.585208 unknown
InChI: InChI=1S/C11H12Br2O3/c1-14-9-4-11-10(15-6-16-11)3-7(9)2-8(13)5-12/h3-4,8H,2,5-6H2,1H3
charge 0 multiplicity 1
28 atoms
Br -4.533589 -1.079083 -1.238859
Br -3.848305 -1.023899 2.429316
O  2.841375 -2.005449 -0.749995
O  3.684332 -0.036907 0.349618
O  -0.751023 2.222978 0.019526
C  -1.797973 -0.023299 -1.318268
C  -0.354294 0.018827 -0.833543
C  -2.735199 -0.74506 -0.30959
C  0.168112 1.171296 -0.173529
C  0.498597 -1.099729 -1.057203
C  1.820574 -1.026475 -0.618758
C  2.317175 0.12298 0.02275
C  1.522714 1.245802 0.262602
C  -2.959151 0.05742 0.966464
C  4.038649 -1.416314 -0.095849
C  -0.252457 3.468896 0.608868
H  -2.17656 0.99654 -1.500084
H  -1.851174 -0.576988 -2.271889
H  -2.373135 -1.762673 -0.090983
H  0.12333 -1.987658 -1.574593
H  1.935152 2.124851 0.760831
H  -1.993776 0.367556 1.394529
H  -3.604925 0.932035 0.805116
H  4.300399 -2.019262 0.791305
H  4.858024 -1.352398 -0.831401
H  0.114697 3.307518 1.640885
H  -1.119856 4.1447 0.626769
H  0.55269 3.909794 -0.009734
