program: Gaussian 09
title: 000231477
version: EM64L-G09RevD.01
frameworkgroup: C1[X(C15H23NO)]
method: RPBEPBE
basis: SDD
operation: Freq
keyword: #p
keyword: freq=noraman
keyword: PBEPBE/SDD
title: #p freq=noraman PBEPBE/SDD
converged: YES YES NO NO
title: Mulliken charges:
elementType: O N C C C C C C C C C C C C C C C H H H H H H H H H H H H H H H H H H H H H H H
charge: -0.445063 -0.089999 -0.402146 -0.357696 -0.377403 -0.399299 -0.413979 -0.402278 -0.484815 0.314209 -0.563827 0.095150 0.343561 0.387265 -0.623593 -0.828012 -0.817159 0.227487 0.200744 0.212760 0.171868 0.202640 0.194517 0.208091 0.195683 0.200206 0.194190 0.197573 0.195573 0.229853 0.235345 0.276801 0.217650 0.220622 0.219502 0.235186 0.225343 0.225116 0.226041 0.352292
chargesum: 0.00000
title: Mulliken charges with hydrogens summed into heavy atoms:
elementType: O N C C C C C C C C C C C C C C C
charge: -0.092771 -0.089999 0.026085 0.026931 0.019754 0.004475 -0.019583 -0.009131 -0.019616 0.314209 -0.287026 0.095150 0.343561 0.387265 -0.405943 -0.152702 -0.140659
polarizability: 2.20003749e+02 -4.85905708e+00 1.71937403e+02 1.07417579e+01 1.36912925e+00 1.24656794e+02
1716.lowfreq: -7.4984 0.0005 0.0006 0.0008 1.9266 8.6560 23.8788 36.8001 49.7298
frequency: 23.8682 36.7564 49.7105 101.3019 104.8278 113.1887 138.8051 161.0414 176.5051 206.0310 234.2906 243.7205 262.9256 287.2620 310.3016 316.6889 334.7716 347.9939 361.1199 391.8789 428.0540 451.9783 457.5749 485.5171 503.3722 528.0204 572.8101 612.4375 667.6437 712.6339 720.6573 736.5647 801.7419 807.9550 822.7108 831.7917 840.3533 856.5819 921.5638 946.5189 954.1456 980.7340 984.0088 989.3430 998.6398 1004.6554 1029.1723 1049.4082 1052.2140 1062.2819 1089.7155 1111.2719 1129.1739 1134.3558 1147.0731 1177.1663 1180.4548 1201.6115 1208.8059 1235.5900 1241.7310 1259.9829 1273.0085 1293.0722 1299.4135 1313.8666 1330.7844 1336.9934 1343.2221 1348.4850 1354.8617 1361.7978 1381.4331 1390.3917 1395.5876 1403.6270 1406.3464 1452.3687 1457.9516 1460.7063 1461.7741 1462.4612 1468.9495 1472.8191 1474.7313 1478.6106 1485.0766 1492.7023 1506.1286 1600.5160 1627.6596 2832.9330 2894.1798 2953.8100 2959.4321 2959.8501 2962.8182 2966.3559 2967.4404 2969.9172 2987.1191 2988.9368 3012.2356 3017.6744 3027.8880 3031.4202 3036.5395 3040.5364 3042.0851 3078.3336 3082.6318 3095.2218 3130.4797 3580.1589
redmass: 3.5699 3.3717 3.3919 3.3036 2.6211 1.1117 1.2783 2.1099 2.1153 4.9428 2.8811 2.3737 2.6062 2.5183 2.2868 2.7035 1.2628 2.6329 3.0815 2.5661 2.4642 3.0001 4.2796 1.5491 2.6771 3.5897 3.1908 4.0394 4.5489 2.8751 3.0026 5.4683 2.0736 2.1883 2.0273 1.4920 2.6671 1.5871 1.3522 2.1201 2.2122 1.5835 1.8126 2.2047 1.4020 1.5603 1.4412 3.0661 1.6119 2.6754 2.0728 2.2504 1.6428 1.7254 1.9279 1.6913 1.5951 1.3222 1.7754 1.1641 1.3844 1.2968 1.1740 5.1980 1.3718 1.4401 1.3705 1.4452 1.3697 1.4912 1.4519 1.3536 2.8794 1.4575 1.6650 1.7189 1.6324 1.0858 1.0863 1.0884 1.0486 1.0791 1.0956 1.1631 1.0623 1.1478 1.0840 1.0848 2.8942 6.7767 6.9116 1.0722 1.0691 1.0599 1.0642 1.0675 1.0383 1.0618 1.0376 1.0759 1.0746 1.0876 1.0945 1.1006 1.1017 1.0970 1.0986 1.0969 1.0975 1.0985 1.0973 1.0907 1.0908 1.0659
irintensity: 0.3483 0.3904 0.4898 1.1496 0.4720 0.0691 2.7598 0.6208 4.3295 1.9668 1.6883 1.5706 4.0776 0.0415 2.7003 1.1873 83.8033 3.8439 35.7902 0.2653 9.5238 11.7110 1.3339 1.2986 12.8254 1.5078 6.3653 0.4687 10.5485 0.6987 0.8412 1.8610 1.2547 13.1665 0.9240 23.0456 4.4521 1.1447 6.5655 24.4452 7.8506 13.6233 5.2956 2.5273 25.2812 2.2355 18.7194 36.6576 0.2075 32.0870 35.6611 8.6162 8.0385 95.5531 26.2430 7.7656 26.9529 1.6463 10.2790 0.9667 4.4884 62.8078 2.9407 15.9390 13.3722 3.0124 4.9640 0.7559 15.9289 15.1854 0.1068 1.1186 8.4305 7.8789 19.4774 3.6179 14.9530 9.8496 14.5062 14.8331 0.4548 6.6943 5.5209 46.7717 29.6034 2.6203 6.7162 13.4910 41.5164 10.5621 9.4138 94.0839 42.2196 27.1403 35.1835 29.0590 57.5105 26.9277 38.4000 20.4122 63.5076 29.3947 71.6828 49.1334 57.0802 35.7743 93.1432 13.1311 33.3548 29.9257 12.7382 31.3614 3.9267 23.1337
temp: 298.150 k
press: 1.00000 atm
elementType: 8 7 6 6 6 6 6 6 6 6 6 6 6 6 6 6 6 1 1 1 1 1 1 1 1 1 1 1 1 1 1 1 1 1 1 1 1 1 1 1
symmnumber: 1
zpe: 914451.5 jmol-1
zpe.correction: 0.348296 hartree
zpe.thermalcorrener: 0.365993 hartree
zpe.thermalcorrenthalpy: 0.366937 hartree
zpe.thermalcorrgfe: 0.302442 hartree
zpe.sumelectzpe: -714.038198 hartree
zpe.sumelectthermal: -714.020501 hartree
zpe.sumelectthermalent: -714.019557 hartree
zpe.sumelectthermalfe: -714.084053 hartree
dipole: 0.9340 0.3876 0.6386
dipole: 1.1960
quadrupole: -90.5217 -97.9098 -105.5079
quadrupole: 4.1837 2.6884 0.8961
quadrupole: 7.4581 0.0700 -7.5281 4.1837 2.6884 0.8961
hfenergy: -714.3864945 hartree
pointgroup: C01 [X(C15H23N1O1)]
dipole: -0.374063 -0.0609822 0.2788623 debye
polarizability: 220.362488|-7.7382084|165.8984852|-6.4171917|-16.0218086|130.3369737 unknown
InChI: InChI=1S/C15H23NO/c1-12-9-14(15(17)10-13(12)2)11-16-7-5-3-4-6-8-16/h9-10,17H,3-8,11H2,1-2H3
charge 0 multiplicity 1
40 atoms
O  -1.484206 -2.732891 0.873445
N  1.541073 -0.023531 -0.426552
C  1.812756 0.747502 0.814465
C  2.714157 -0.490717 -1.210865
C  2.948695 0.226241 1.744517
C  3.92776 0.46613 -1.216657
C  4.342254 0.776027 1.351984
C  4.881443 0.277625 -0.009015
C  0.548839 -1.108592 -0.24842
C  -0.88728 -0.611247 -0.11313
C  -1.286964 0.666381 -0.564831
C  -1.888278 -1.447171 0.438638
C  -2.622795 1.128767 -0.484051
C  -3.61424 0.271264 0.079669
C  -3.229244 -1.012027 0.535156
C  -2.987313 2.51422 -0.990041
C  -5.061818 0.716588 0.190622
H  0.858102 0.781396 1.370772
H  2.047361 1.798473 0.546586
H  2.365913 -0.648429 -2.252069
H  3.080051 -1.487692 -0.850541
H  2.954556 -0.883353 1.752142
H  2.726089 0.543911 2.783137
H  3.581858 1.516095 -1.289278
H  4.50332 0.263839 -2.141468
H  5.079109 0.517312 2.139182
H  4.280326 1.884775 1.333837
H  5.838033 0.798473 -0.217396
H  5.125382 -0.802483 0.069381
H  0.78618 -1.7705 0.618104
H  0.605914 -1.76493 -1.140648
H  -0.503396 1.302506 -0.992884
H  -3.989258 -1.678638 0.967281
H  -3.7428 2.471323 -1.799142
H  -3.418397 3.145649 -0.188272
H  -2.10014 3.035516 -1.387422
H  -5.69037 -0.063474 0.653587
H  -5.158805 1.635074 0.801251
H  -5.491349 0.950869 -0.802769
H  -2.251516 -3.219879 1.263992
