program: Gaussian 09
title: 000231475
version: EM64L-G09RevD.01
frameworkgroup: C1[X(C11H17NO)]
method: RPBEPBE
basis: SDD
operation: Freq
keyword: #p
keyword: freq=noraman
keyword: PBEPBE/SDD
title: #p freq=noraman PBEPBE/SDD
converged: YES YES NO NO
title: Mulliken charges:
elementType: O N C C C C C C C C C C C H H H H H H H H H H H H H H H H H
charge: -0.436974 -0.103241 0.339627 -0.472879 -0.085181 -0.546227 0.352516 0.487987 -0.603709 -0.630109 -0.615179 -0.871034 -0.823918 0.223272 0.228828 0.282672 0.233351 0.218784 0.249451 0.188209 0.219543 0.186632 0.225928 0.227908 0.232862 0.249010 0.218330 0.231657 0.225065 0.366819
chargesum: 0.00000
title: Mulliken charges with hydrogens summed into heavy atoms:
elementType: O N C C C C C C C C C C C
charge: -0.070155 -0.103241 0.339627 -0.020778 -0.085181 -0.263555 0.352516 0.487987 -0.370358 0.026335 0.016924 -0.161254 -0.148866
polarizability: 1.60141082e+02 -6.53597347e-01 1.46087824e+02 5.97954881e+00 -1.12182324e+00 8.46978601e+01
1716.lowfreq: -18.5690 -5.1379 -0.0006 -0.0005 0.0005 6.8786 9.9968 35.1338 77.3022
frequency: -15.6347 34.9894 77.2090 100.1028 121.7790 153.9984 180.0459 222.7329 234.4355 241.2645 250.0516 273.1797 296.2138 299.5484 338.8612 348.3791 353.6327 430.0158 454.0860 500.0982 521.1792 562.5921 570.3991 641.5606 731.3552 755.9028 820.9218 871.9693 919.6066 932.6018 960.3993 990.4583 1004.6293 1012.2267 1035.5729 1041.7046 1046.9298 1049.8645 1092.4530 1135.9784 1137.6292 1163.5474 1169.2588 1221.8251 1250.5027 1267.0114 1289.2753 1327.2028 1354.9511 1386.9989 1396.3773 1397.0358 1418.0840 1420.0565 1439.7191 1455.8184 1461.9361 1462.6528 1472.2619 1475.6392 1477.7606 1478.2647 1480.5076 1486.9382 1493.5480 1614.1029 1624.1496 2848.4604 2860.6401 2892.7030 2948.0824 2969.8513 2990.3847 3014.9307 3015.2443 3024.0011 3049.6768 3074.4046 3079.0870 3084.4254 3084.7508 3113.1342 3131.3494 3581.4515
redmass: 1.0144 2.8317 2.8661 3.2308 3.3778 1.1537 2.5080 2.0392 1.2742 1.1809 2.6629 2.5395 1.5479 2.0452 2.8399 3.1270 2.7540 2.3361 5.7419 3.3809 3.8017 4.1303 3.2813 3.9879 4.0279 5.3998 4.7206 1.3022 2.3619 1.4020 3.1671 1.8524 1.8264 1.4496 1.5506 1.5075 2.0716 1.5477 1.2501 2.6530 1.4339 1.5453 1.7723 1.7437 1.4804 2.3666 1.5486 6.0697 1.5826 2.9692 1.4430 1.2417 1.1436 2.6579 1.2110 1.8921 1.0595 1.0931 1.0555 1.0741 1.0470 1.0643 1.1591 1.0559 1.4403 6.4765 6.7039 1.0569 1.0574 1.0681 1.0402 1.0387 1.0886 1.0976 1.0723 1.0728 1.0949 1.1010 1.0996 1.1005 1.0941 1.0914 1.0913 1.0653
irintensity: 0.5604 0.1986 1.6168 1.7860 0.8299 0.1293 1.9012 7.8407 4.3996 3.3068 1.4697 6.5911 65.7163 39.3140 3.7671 6.9041 2.6420 1.2502 4.1459 0.8613 1.5225 11.4833 4.3286 2.5371 3.7822 27.6514 8.0144 17.3200 11.4562 8.6668 1.8582 4.9357 8.2112 10.2206 18.7363 1.7194 43.7436 19.8145 6.3038 65.2648 8.4290 120.4844 6.4511 11.2837 41.4072 4.5225 16.3516 3.5505 7.5784 7.4672 26.3930 7.7773 4.0597 2.0182 1.9645 46.5540 15.4827 6.2995 9.7420 15.8526 17.3115 16.7771 6.4777 13.5352 42.2095 1.8048 0.4035 75.2139 184.3408 71.8732 45.5517 45.6047 23.2127 23.1350 45.8847 37.9583 24.9241 32.8814 19.9684 43.5911 10.4978 21.7489 4.5571 25.7584
temp: 298.150 k
press: 1.00000 atm
elementType: 8 7 6 6 6 6 6 6 6 6 6 6 6 1 1 1 1 1 1 1 1 1 1 1 1 1 1 1 1 1
symmnumber: 1
zpe: 669876.2 jmol-1
zpe.correction: 0.255142 hartree
zpe.thermalcorrener: 0.269148 hartree
zpe.thermalcorrenthalpy: 0.270092 hartree
zpe.thermalcorrgfe: 0.214895 hartree
zpe.sumelectzpe: -558.324762 hartree
zpe.sumelectthermal: -558.310757 hartree
zpe.sumelectthermalent: -558.309812 hartree
zpe.sumelectthermalfe: -558.365010 hartree
dipole: 1.2258 -0.8293 0.5224
dipole: 1.5695
quadrupole: -68.3134 -74.6590 -81.2509
quadrupole: -3.8809 0.7182 -0.3438
quadrupole: 6.4277 0.0821 -6.5098 -3.8809 0.7182 -0.3438
hfenergy: -558.5799045 hartree
pointgroup: C01 [X(C11H17N1O1)]
dipole: 0.4652135 0.3649874 -0.1779445 debye
polarizability: 160.1801017|1.7694977|146.181642|-4.6299047|2.0387062|84.5650228 unknown
InChI: InChI=1S/C11H17NO/c1-8-5-9(2)11(13)10(6-8)7-12(3)4/h5-6,13H,7H2,1-4H3
charge 0 multiplicity 1
30 atoms
O  0.358552 2.558596 0.214513
N  -2.736026 -0.299407 -0.079747
C  -0.302422 0.238014 0.217747
C  -1.74619 0.686556 0.41835
C  0.737551 1.196002 0.126721
C  0.044107 -1.130109 0.152252
C  2.096401 0.813197 -0.037448
C  1.38518 -1.557708 -0.004662
C  2.394379 -0.568372 -0.102675
C  -2.778408 -0.357604 -1.555587
C  -4.075337 -0.090894 0.503052
C  3.186759 1.867006 -0.140083
C  1.733809 -3.036867 -0.043997
H  -1.928155 0.823219 1.503752
H  -1.883216 1.693625 -0.044002
H  -0.775211 -1.855701 0.220169
H  3.440223 -0.875899 -0.231982
H  -3.457393 -1.167917 -1.877018
H  -1.770957 -0.575511 -1.949259
H  -3.131438 0.59871 -2.019672
H  -4.756281 -0.89108 0.160413
H  -4.536045 0.891746 0.225054
H  -4.01594 -0.140702 1.605215
H  3.038898 2.545295 -1.006001
H  3.25277 2.49355 0.773013
H  4.17284 1.392384 -0.273989
H  2.668801 -3.219744 -0.603269
H  1.87604 -3.44462 0.976242
H  0.931039 -3.627206 -0.52062
H  1.145268 3.144842 0.089419
