program: Gaussian 09
title: 000231474
version: EM64L-G09RevD.01
frameworkgroup: C1[X(C10H16O4)]
method: RPBEPBE
basis: SDD
operation: Freq
keyword: #pfreq=noraman
keyword: PBEPBE/SDD
title: #p freq=noraman PBEPBE/SDD
converged: YES YES NO NO
title: Mulliken charges:
elementType: O O O O C C C C C C C C C C H H H H H H H H H H H H H H H H
charge: -0.235776 -0.286694 -0.251081 -0.261429 -0.036322 0.308644 -0.246486 -0.752850 0.167187 0.160754 -0.259154 -0.686710 -0.735974 -0.669964 0.280672 0.210347 0.239366 0.262670 0.245889 0.222092 0.236651 0.213945 0.225485 0.235037 0.231630 0.261464 0.228515 0.218994 0.249141 0.223958
chargesum: 0.00000
title: Mulliken charges with hydrogens summed into heavy atoms:
elementType: O O O O C C C C C C C C C C
charge: -0.235776 -0.286694 -0.251081 -0.261429 -0.036322 0.308644 0.244533 -0.004925 0.167187 0.160754 0.199589 -0.012243 -0.014366 0.022128
polarizability: 1.73762602e+02 -3.69342276e+00 1.29032283e+02 1.45205780e+00 2.03618713e+00 8.75822840e+01
1716.lowfreq: -11.5891 -6.7350 0.0009 0.0012 0.0014 3.8194 29.3760 35.2609 49.0034
frequency: 29.1127 34.9013 48.9831 80.9948 84.9067 94.3309 129.5483 132.6725 158.6000 166.4138 189.6353 201.2383 212.6055 232.0994 251.6931 306.1697 325.0706 346.4978 374.9892 419.8821 434.1076 499.3778 503.9939 558.1181 602.9781 628.4786 719.8468 735.9979 786.8976 812.6623 827.7522 840.2758 935.9365 981.1522 990.1886 1011.3725 1016.9179 1031.2174 1038.8336 1049.8064 1092.9044 1112.5046 1137.0646 1152.0913 1212.1023 1222.2178 1255.6091 1278.5675 1283.6282 1354.4304 1356.3190 1370.3062 1387.8871 1396.4639 1399.2611 1440.7978 1445.3600 1448.1357 1450.0252 1455.0404 1461.9969 1463.8506 1471.6139 1482.9753 1484.4807 1520.1324 1563.6675 1605.8577 2987.0705 2990.8605 2995.5770 2998.6068 3007.7865 3029.6725 3071.5765 3085.0454 3091.2666 3092.7920 3093.0013 3096.1867 3107.5487 3116.5887 3117.2076 3128.3328
redmass: 3.5229 3.0765 3.4383 2.9461 2.1813 1.5299 1.2178 2.0192 2.6824 1.6296 4.1081 5.6319 2.0995 1.6474 1.5932 3.3652 3.1194 3.2792 5.4815 3.2968 7.4285 3.2935 4.7431 3.5697 3.7005 4.1955 3.2805 6.6825 3.0108 1.3865 1.1145 2.9787 3.7590 2.9796 1.6820 1.9476 1.8801 4.8951 1.6571 1.9789 2.1494 2.2292 1.5132 1.6749 4.7477 6.2566 1.2158 1.2766 2.6357 1.2807 1.4661 1.2012 1.2332 1.2097 1.2521 1.1043 1.0736 1.0712 1.0950 1.0965 1.0407 1.0443 1.0875 1.0513 1.0754 5.8066 7.2273 8.8166 1.0606 1.0359 1.0373 1.0352 1.0369 1.0593 1.1021 1.0975 1.1028 1.0979 1.0980 1.0955 1.1020 1.1015 1.1059 1.1020
irintensity: 1.9074 0.9635 2.3488 0.0736 0.3874 0.3918 0.7117 1.2364 1.5587 5.8309 6.1517 2.1115 0.7530 2.0649 1.8692 6.4677 14.8269 1.9786 8.8636 1.5311 1.6472 3.5089 8.6008 1.8305 7.5476 19.1379 3.1424 10.5678 19.1479 0.3090 8.8324 4.0575 18.8433 51.6042 3.7196 25.7205 0.5443 473.2533 6.9077 23.0642 19.6221 14.0723 21.3690 27.2427 150.4246 115.2846 3.3918 47.4104 154.1041 1.9483 10.2415 42.4734 28.9667 32.9632 31.5679 63.2281 40.5380 4.5205 27.4188 24.5905 11.6844 18.1311 17.0012 13.1936 23.6665 295.3019 369.8107 143.0143 17.8260 21.1738 21.0491 6.1112 3.4811 34.7339 2.1426 42.7452 2.9458 3.9050 27.0089 7.5226 30.4861 26.2313 24.2981 11.0567
temp: 298.150 k
press: 1.00000 atm
elementType: 8 8 8 8 6 6 6 6 6 6 6 6 6 6 1 1 1 1 1 1 1 1 1 1 1 1 1 1 1 1
symmnumber: 1
zpe: 640843.5 jmol-1
zpe.correction: 0.244084 hartree
zpe.thermalcorrener: 0.261123 hartree
zpe.thermalcorrenthalpy: 0.262067 hartree
zpe.thermalcorrgfe: 0.198278 hartree
zpe.sumelectzpe: -690.432244 hartree
zpe.sumelectthermal: -690.415205 hartree
zpe.sumelectthermalent: -690.414261 hartree
zpe.sumelectthermalfe: -690.478050 hartree
dipole: 0.4272 -0.3473 2.0763
dipole: 2.1481
quadrupole: -68.5937 -86.8306 -86.8014
quadrupole: -3.8123 -5.8377 -6.9679
quadrupole: 12.1482 -6.0887 -6.0595 -3.8123 -5.8377 -6.9679
hfenergy: -690.6763285 hartree
pointgroup: C01 [X(C10H16O4)]
dipole: -0.1692735 -0.0082492 -0.8279569 debye
polarizability: 173.7778562|3.3658434|128.6517921|1.8904544|4.3943917|87.9475202 unknown
InChI: InChI=1S/C10H16O4/c1-5-13-8(4)9(7(3)11)10(12)14-6-2/h5-6H2,1-4H3
charge 0 multiplicity 1
30 atoms
O  2.49409 0.737638 0.221816
O  -2.229187 -0.344519 0.430341
O  1.151204 -1.963576 0.88307
O  -1.612459 1.821054 -0.170666
C  0.101602 0.084759 0.163067
C  1.151267 0.993733 0.36427
C  3.067998 -0.445356 -0.480034
C  0.978178 2.44536 0.74877
C  0.283368 -1.403736 0.140825
C  -1.275023 0.636807 0.101636
C  -3.660341 0.076182 0.363008
C  4.466403 -0.036061 -0.930563
C  -0.559899 -2.26532 -0.797384
C  -4.210661 -0.065399 -1.059864
H  3.069141 -1.293296 0.225237
H  2.408787 -0.700091 -1.333703
H  1.938677 2.821417 1.136366
H  0.685981 3.045376 -0.130927
H  0.181733 2.580047 1.496238
H  -4.161318 -0.604137 1.070407
H  -3.736614 1.118991 0.717297
H  4.955537 -0.892052 -1.430621
H  4.43198 0.809987 -1.638085
H  5.08463 0.256039 -0.064671
H  0.095598 -3.040128 -1.233384
H  -1.346029 -2.778167 -0.216727
H  -1.047371 -1.684533 -1.595677
H  -5.288703 0.181691 -1.068185
H  -3.695525 0.625746 -1.747939
H  -4.092244 -1.098555 -1.430422
