program: Gaussian 09
title: 000231473
version: EM64L-G09RevD.01
frameworkgroup: C1[X(C10H16O3)]
method: RPBEPBE
basis: SDD
operation: Freq
keyword: #pfreq=noraman
keyword: PBEPBE/SDD
title: #p freq=noraman PBEPBE/SDD
converged: YES YES NO NO
title: Mulliken charges:
elementType: O O O C C C C C C C C C C H H H H H H H H H H H H H H H H
charge: -0.232063 -0.255410 -0.220248 0.311888 -0.497878 -0.013226 -0.683964 -0.240010 0.159366 0.076269 -0.686591 -0.761582 -0.769772 0.223618 0.243906 0.223383 0.241521 0.232430 0.208684 0.283434 0.216529 0.234180 0.222113 0.221329 0.239119 0.281568 0.251460 0.241172 0.248774
chargesum: 0.00000
title: Mulliken charges with hydrogens summed into heavy atoms:
elementType: O O O C C C C C C C C C C
charge: -0.232063 -0.255410 -0.220248 0.311888 -0.030354 -0.013226 0.013369 0.252108 0.159366 0.076269 -0.013768 -0.019565 -0.028366
polarizability: 1.52065802e+02 4.19192194e+00 1.27866161e+02 -2.92718827e+00 5.24271895e+00 9.48158476e+01
1716.lowfreq: -12.3366 -0.0007 0.0002 0.0005 2.2073 8.7119 38.1391 44.0275 57.1347
frequency: 38.1324 44.0116 57.1032 79.8587 100.7322 121.9680 144.5269 157.0857 170.1373 197.6408 203.7712 223.4543 239.7455 249.4376 280.7899 328.2897 340.8894 371.5842 414.6265 483.7419 510.0521 568.7729 575.6017 617.2118 627.7661 709.9443 784.9281 819.2241 844.2234 889.9184 939.2767 971.9717 998.6027 1008.1976 1011.5678 1024.7702 1039.0669 1061.9935 1095.4711 1110.5031 1138.4542 1204.1924 1219.3050 1249.1264 1256.1028 1286.5260 1310.7161 1347.9742 1369.3618 1372.1383 1389.4186 1396.7974 1440.3489 1447.1579 1449.7330 1456.7370 1461.4109 1465.7103 1470.9195 1472.6519 1483.6789 1487.5437 1505.9162 1562.1584 1575.2485 2989.8013 2990.9322 2994.9038 2995.1534 2995.5322 3005.4687 3075.6193 3076.7210 3086.8243 3089.4785 3092.5079 3094.0802 3107.6413 3115.4096 3119.4768 3120.9828
redmass: 2.9767 4.8285 2.6858 2.5969 2.0652 1.1583 1.7600 2.1876 1.8053 2.6971 1.8674 3.1770 1.5084 1.9577 3.3139 3.0015 3.1500 4.1064 4.0214 4.2179 4.0284 3.3715 3.7647 3.3322 3.4415 3.5587 1.6157 1.1029 1.9640 3.5814 2.8264 2.2169 1.8981 1.8848 1.7269 1.8455 2.4961 2.0917 1.6918 2.1691 1.5311 3.3582 3.3813 1.1853 1.9699 2.1205 1.4376 1.5061 1.2257 1.1943 1.2093 1.2598 1.1233 1.0777 1.0908 1.0855 1.0416 1.1001 1.0565 1.0711 1.0934 1.1099 3.4530 8.5401 6.8011 1.0375 1.0582 1.0366 1.0396 1.0348 1.0641 1.0953 1.1010 1.0964 1.0973 1.0979 1.1009 1.1021 1.1013 1.1015 1.1011
irintensity: 0.2454 2.6910 0.6106 3.7193 1.2420 0.8701 2.2872 1.6032 3.8552 3.9186 1.1123 4.5364 0.5939 1.6683 3.6175 2.9843 2.0515 3.5096 0.7417 8.3178 2.1403 4.4499 20.5190 5.5385 24.9288 5.0117 4.7600 9.4096 4.9381 12.2933 25.7621 13.0819 9.2233 20.1319 4.2180 7.4585 27.7932 119.7442 26.3613 4.0991 10.4478 132.6512 34.3345 27.6114 99.3891 203.4193 49.3922 20.0433 69.2986 43.8284 22.4480 15.9895 57.0612 28.4651 37.1575 18.6481 13.0420 36.8384 13.1509 10.0463 32.6877 12.7149 218.2884 301.9709 87.9593 4.4572 14.8006 4.0890 27.4453 29.4207 18.7147 9.1215 2.8584 9.6520 7.9795 18.6072 28.0030 30.4089 37.6762 16.5268 6.2286
temp: 298.150 k
press: 1.00000 atm
elementType: 8 8 8 6 6 6 6 6 6 6 6 6 6 1 1 1 1 1 1 1 1 1 1 1 1 1 1 1 1
symmnumber: 1
zpe: 629394.0 jmol-1
zpe.correction: 0.239723 hartree
zpe.thermalcorrener: 0.255686 hartree
zpe.thermalcorrenthalpy: 0.256631 hartree
zpe.thermalcorrgfe: 0.196046 hartree
zpe.sumelectzpe: -615.276046 hartree
zpe.sumelectthermal: -615.260083 hartree
zpe.sumelectthermalent: -615.259139 hartree
zpe.sumelectthermalfe: -615.319724 hartree
dipole: 2.5057 1.7364 3.5738
dipole: 4.6974
quadrupole: -84.0960 -73.8877 -79.7627
quadrupole: -1.2705 -1.1525 -4.3585
quadrupole: -4.8472 5.3611 -0.5139 -1.2705 -1.1525 -4.3585
hfenergy: -615.5157693 hartree
pointgroup: C01 [X(C10H16O3)]
dipole: 0.9643272 -0.8394889 -1.3344835 debye
polarizability: 147.4038744|-9.8430465|130.615934|9.7547296|4.5962071|96.7280019 unknown
InChI: InChI=1S/C10H16O3/c1-5-9(13-6-2)10(7(3)11)8(4)12/h5-6H2,1-4H3
charge 0 multiplicity 1
29 atoms
O  1.6370 -0.680498 -0.050337
O  0.57519 1.783334 1.286743
O  -3.01517 0.709021 -0.267718
C  0.272126 -0.74575 -0.182673
C  -0.142938 -2.206398 -0.152469
C  -0.622886 0.334548 -0.23725
C  0.128337 -2.816653 1.253055
C  2.445354 0.537617 -0.342322
C  -0.321551 1.665938 0.39047
C  -2.008692 0.127539 -0.777274
C  3.821178 0.048728 -0.783539
C  -1.130636 2.887742 -0.025376
C  -2.209186 -0.688831 -2.062119
H  0.429261 -2.774948 -0.909669
H  -1.216085 -2.302076 -0.377332
H  -0.180346 -3.876844 1.265973
H  1.200267 -2.758013 1.503145
H  -0.440937 -2.279437 2.031735
H  1.92666 1.116564 -1.132051
H  2.471248 1.147591 0.575429
H  4.475062 0.919967 -0.971883
H  4.288024 -0.566491 0.004526
H  3.762754 -0.550792 -1.708251
H  -1.306355 2.920985 -1.115355
H  -0.595171 3.791687 0.305651
H  -2.124056 2.855477 0.455628
H  -3.060072 -1.382358 -1.944518
H  -1.313208 -1.235716 -2.392088
H  -2.488368 0.024767 -2.861131
