program: Gaussian 09
title: 000231472
version: EM64L-G09RevD.01
frameworkgroup: C1[X(C10H15NO3)]
method: RPBEPBE
basis: SDD
operation: Freq
keyword: #p
keyword: freq=noraman
keyword: PBEPBE/SDD
title: #p freq=noraman PBEPBE/SDD
converged: YES YES NO NO
title: Mulliken charges:
elementType: O O O N C C C C C C C C C C H H H H H H H H H H H H H H H
charge: -0.247500 -0.269823 -0.269704 -0.043090 -0.483978 0.359853 -0.031917 -0.686688 -0.238853 0.191235 -0.685877 -0.257604 -0.666440 -0.187111 0.227387 0.263991 0.219074 0.251029 0.226586 0.248461 0.240275 0.219891 0.230099 0.232639 0.231835 0.228928 0.217297 0.233187 0.246820
chargesum: 0.00000
title: Mulliken charges with hydrogens summed into heavy atoms:
elementType: O O O N C C C C C C C C C C
charge: -0.247500 -0.269823 -0.269704 -0.043090 0.007400 0.359853 -0.031917 0.010001 0.249882 0.191235 -0.003250 0.203159 0.030864 -0.187111
polarizability: 1.68239516e+02 3.76009198e+00 1.42775132e+02 4.10421410e+00 4.78698460e+00 8.33992050e+01
1716.lowfreq: -7.9843 -0.0008 -0.0003 -0.0002 5.7654 11.7530 17.8761 37.5300 63.0810
frequency: 17.6242 37.3577 63.0095 81.7097 93.9774 106.3525 115.4999 128.4682 166.4552 183.0651 210.3989 214.7937 235.5850 247.4709 274.8793 285.8098 327.3860 334.9807 413.0757 444.7878 495.5880 518.2833 536.8833 575.8924 669.5895 730.1651 750.2567 763.5883 801.5267 817.4471 817.9615 853.9373 940.0779 990.9207 1004.6225 1037.6336 1053.9182 1074.4402 1095.6306 1107.4104 1123.0016 1130.9493 1155.6585 1211.9627 1234.5592 1261.1676 1279.3367 1292.5819 1313.0823 1355.5183 1363.6170 1386.9778 1391.2093 1400.6181 1446.8432 1456.7395 1462.0714 1462.6931 1467.3956 1475.0198 1482.3615 1484.3196 1485.0269 1550.2800 1610.6166 2164.1946 2993.6434 2993.7886 2998.3355 3024.1697 3026.8819 3030.1012 3086.9562 3089.3437 3090.5517 3094.8496 3096.7201 3101.1530 3116.4849 3117.8102 3120.6312
redmass: 4.3787 3.8980 3.2290 4.1109 3.6237 3.4219 2.0070 2.4130 6.9126 1.9593 1.1235 2.6473 1.5294 1.7223 3.4411 4.3266 3.4429 3.4853 2.9406 4.7698 4.7684 8.5438 7.5840 4.8992 6.4926 3.4638 9.2683 1.6543 2.0110 1.1231 1.4285 2.5786 2.5429 2.4062 2.2752 4.7988 2.8357 1.9425 2.1528 2.3427 1.5129 2.4649 1.6871 3.9675 2.7679 1.1496 1.1172 1.5668 1.3599 1.2851 1.3998 1.2279 1.2333 1.2652 1.1407 1.0918 1.0396 1.0430 1.0731 1.0491 1.0641 1.0577 1.0518 6.3501 9.0469 12.6260 1.0353 1.0355 1.0358 1.0580 1.0617 1.0598 1.1004 1.0974 1.1046 1.1028 1.0985 1.0984 1.1027 1.1057 1.1060
irintensity: 2.9369 1.7427 0.6297 0.1605 0.3157 0.7634 1.9226 1.5885 3.7614 1.4327 0.5447 3.7061 1.3403 3.6498 0.8844 0.9350 17.0927 6.7806 2.2843 2.8827 6.9959 0.1332 7.7380 2.7333 1.9417 3.1266 10.7110 5.2613 15.8378 4.1350 1.0618 3.7766 51.2480 10.1720 13.2925 412.8375 113.5745 24.1232 27.5073 54.4830 8.5004 7.5733 47.0647 56.2411 284.1984 0.8055 5.2810 36.8199 8.7374 3.7124 5.2480 21.5129 26.0238 24.7238 41.5595 17.4476 13.7631 13.8036 16.3930 6.5617 19.3709 13.4851 18.7999 363.4593 202.7346 45.8720 45.2561 9.4280 18.1292 6.9539 18.6932 32.7101 21.2365 36.7375 0.2092 1.5495 19.0654 16.2790 15.9101 36.8137 29.3221
temp: 298.150 k
press: 1.00000 atm
elementType: 8 8 8 7 6 6 6 6 6 6 6 6 6 6 1 1 1 1 1 1 1 1 1 1 1 1 1 1 1
symmnumber: 1
zpe: 616362.0 jmol-1
zpe.correction: 0.234760 hartree
zpe.thermalcorrener: 0.251306 hartree
zpe.thermalcorrenthalpy: 0.252251 hartree
zpe.thermalcorrgfe: 0.189224 hartree
zpe.sumelectzpe: -669.368638 hartree
zpe.sumelectthermal: -669.352091 hartree
zpe.sumelectthermalent: -669.351147 hartree
zpe.sumelectthermalfe: -669.414173 hartree
dipole: 1.3416 1.8604 0.2805
dipole: 2.3107
quadrupole: -64.0923 -95.9011 -82.6289
quadrupole: 0.1014 0.2377 -1.5718
quadrupole: 16.7818 -15.0270 -1.7548 0.1014 0.2377 -1.5718
hfenergy: -669.6033975 hartree
pointgroup: C01 [X(C10H15N1O3)]
dipole: -0.5784423 -0.6920642 0.1137121 debye
polarizability: 168.5877087|1.8654464|142.3710001|-4.9796699|-4.4645494|83.4551446 unknown
InChI: InChI=1S/C10H15NO3/c1-4-9(13-5-2)8(7-11)10(12)14-6-3/h4-6H2,1-3H3
charge 0 multiplicity 1
29 atoms
O  -2.407841 -0.075216 0.635929
O  2.319502 0.61914 -0.155783
O  1.657813 -1.588741 0.190256
N  -0.024577 2.866859 -0.122399
C  -1.095586 -2.011532 0.79886
C  -1.110577 -0.521134 0.533894
C  0.013196 0.254814 0.21975
C  -1.250816 -2.829226 -0.513741
C  -2.88562 1.302887 0.280636
C  1.364591 -0.366997 0.099799
C  -4.40535 1.25249 0.384852
C  3.735417 0.160354 -0.291776
C  4.410071 0.075876 1.080234
C  -0.028452 1.678939 0.028804
H  -1.944603 -2.227047 1.471571
H  -0.153309 -2.302797 1.285973
H  -2.169036 -2.542124 -1.0563
H  -0.37765 -2.675877 -1.169071
H  -1.313013 -3.905199 -0.27382
H  -2.444599 2.024731 0.987512
H  -2.544595 1.541474 -0.741634
H  -4.822033 2.245477 0.136884
H  -4.827111 0.512327 -0.316032
H  -4.722308 0.988256 1.407942
H  3.742059 -0.817064 -0.805579
H  4.191513 0.932805 -0.930974
H  5.480981 -0.169646 0.953941
H  4.336557 1.039758 1.612259
H  3.946275 -0.711786 1.697211
