program: Gaussian 09
title: 000231470
version: EM64L-G09RevD.01
frameworkgroup: C1[X(C8H10N2O)]
method: RPBEPBE
basis: SDD
operation: Freq
keyword: #p
keyword: freq=noraman
keyword: PBEPBE/SDD
title: #p freq=noraman PBEPBE/SDD
converged: YES YES NO NO
title: Mulliken charges:
elementType: O N N C C C C C C C C H H H H H H H H H H
charge: -0.235810 -0.019338 -0.009238 -0.488548 0.315855 -0.239165 -0.671240 -0.683312 0.124901 -0.216077 -0.255640 0.241271 0.251762 0.246419 0.244266 0.239979 0.233667 0.229284 0.223746 0.232760 0.234459
chargesum: 0.00000
title: Mulliken charges with hydrogens summed into heavy atoms:
elementType: O N N C C C C C C C C
charge: -0.235810 -0.019338 -0.009238 0.004485 0.315855 0.251520 0.031689 0.007652 0.124901 -0.216077 -0.255640
polarizability: 1.29341837e+02 -1.93942241e+00 1.16833567e+02 1.40578532e+00 4.74828720e+00 6.26978293e+01
1716.lowfreq: 0.0002 0.0003 0.0004 1.6738 5.7181 12.6507 33.8630 41.4124 97.4486
frequency: 33.6638 41.1515 97.4342 116.6773 131.8152 148.0889 177.7913 186.8288 220.0540 238.8118 278.0008 310.2818 389.1271 435.8849 456.3888 535.8161 585.8496 595.1490 618.9798 704.2409 770.3413 818.3791 844.7293 939.6549 1000.8461 1043.8250 1067.1304 1100.7740 1125.4148 1126.6360 1168.3479 1241.7039 1264.5457 1294.7333 1314.0863 1369.5735 1395.0623 1403.5592 1463.1069 1464.7154 1468.1193 1476.5793 1481.9702 1484.8782 1559.3859 2161.5993 2172.9841 2995.1449 3000.7115 3018.6295 3023.6862 3081.3802 3086.3052 3097.2709 3099.4739 3106.9237 3116.1092
redmass: 4.3751 3.1827 2.9321 2.0308 4.3998 9.2514 2.1217 7.2402 1.4657 1.3440 3.2987 3.0239 2.7293 8.6165 11.7134 6.6016 6.2548 8.4563 6.5469 6.5118 1.4684 1.0935 2.1649 2.5657 2.0919 3.2393 1.9410 1.9279 1.9956 1.6256 9.6685 1.5187 1.1434 1.9471 1.4570 1.4571 1.2294 1.2868 1.0392 1.0821 1.0754 1.0437 1.0636 1.0722 7.1243 12.6208 12.6276 1.0346 1.0358 1.0573 1.0599 1.1020 1.1065 1.1002 1.0986 1.1031 1.1045
irintensity: 0.3112 0.2627 0.5422 2.6391 2.0326 5.7534 0.4268 6.9882 0.2190 1.0641 0.6794 3.0885 0.1612 1.3254 0.3543 2.1449 6.8039 0.4499 2.1297 2.5480 4.7002 4.2692 7.1849 17.6364 20.8680 42.9267 80.4886 7.8169 4.7818 6.6922 74.3918 47.8029 0.7066 94.7893 20.5708 2.9060 22.4205 19.8493 15.7779 17.8233 10.0526 18.3896 13.3703 20.0747 240.6554 42.1074 40.6531 24.2373 14.8249 8.9578 10.7813 0.1012 0.6849 26.9814 17.5927 26.7925 35.0540
temp: 298.150 k
press: 1.00000 atm
elementType: 8 7 7 6 6 6 6 6 6 6 6 1 1 1 1 1 1 1 1 1 1
symmnumber: 1
zpe: 430358.7 jmol-1
zpe.correction: 0.163915 hartree
zpe.thermalcorrener: 0.176515 hartree
zpe.thermalcorrenthalpy: 0.177459 hartree
zpe.thermalcorrgfe: 0.124123 hartree
zpe.sumelectzpe: -494.699500 hartree
zpe.sumelectthermal: -494.686900 hartree
zpe.sumelectthermalent: -494.685956 hartree
zpe.sumelectthermalfe: -494.739292 hartree
dipole: 4.4724 -4.4503 -0.2683
dipole: 6.3151
quadrupole: -71.9460 -75.0653 -64.4031
quadrupole: 4.8891 -0.3045 -1.4421
quadrupole: -1.4745 -4.5938 6.0684 4.8891 -0.3045 -1.4421
hfenergy: -494.8634152 hartree
pointgroup: C01 [X(C8H10N2O1)]
dipole: 1.9725365 -1.477316 0.3154987 debye
dipolederiv: -1.8352294 0.1957324 -0.048549 -0.2394656 -0.403192 0.0180515 -0.0299703 0.0288683 -0.2671351 -0.2483857 -0.0703431 0.0106409 0.0091571 -0.4557092 0.0335317 -0.0005815 0.0187713 -0.2463896 -0.458129 0.0146591 -0.0188421 -0.0282314 -0.2196609 -0.001235 -0.0050871 -0.0001514 -0.2355689 -0.0304466 -0.0712396 0.0342727 -0.1024912 -0.1042307 0.0627535 -0.0030586 0.226143 -0.0435783 1.5632805 -0.4473875 0.0556911 -0.5112188 0.88608 -0.1799381 0.0965053 -0.1373802 0.1224242 0.8645762 0.1004809 0.0022406 0.4908269 0.2611839 0.019635 -0.0076723 0.0095564 0.3308012 0.0716156 -0.0269844 0.0120843 0.0076885 -0.0255244 0.025497 -0.0081634 -0.1464867 0.072704 -0.1663864 0.0137083 -0.0100969 -0.0176206 0.0397309 0.004668 -0.0128456 0.0019655 0.0592834 -0.3637126 0.1052937 -0.032028 0.3824775 -0.4700483 0.1032822 -0.0434569 0.0407064 -0.003798 -0.0602957 0.1737896 -0.0244713 0.0397291 0.4949287 -0.0531471 -0.007546 -0.03935 0.0803098 0.5690845 -0.0422966 0.0305337 0.0356671 -0.0972292 0.0106097 0.0118171 0.0053854 0.0343602 0.0189727 0.0720816 0.0907119 0.0637459 0.0052428 -0.0412474 0.0640342 -0.0562417 0.0339749 -0.0341507 -0.0236391 -0.0918788 0.0020119 0.0663368 0.0430447 -0.0542114 0.0149185 0.0280661 -0.0207382 0.0251998 -0.0686315 -0.0941309 0.012789 0.0445238 -0.0507533 0.0751761 -0.0469722 -0.0366773 0.0443513 0.0722059 -0.0780764 -0.0045014 -0.0497593 0.061267 -0.0777641 -0.0242141 0.005085 0.078809 0.0764258 0.0975293 0.0221562 -0.0753799 0.0444057 -0.0346827 0.0262604 0.0787325 -0.0961157 0.0146516 -0.0755884 -0.1490858 0.0447319 0.0028402 0.0662623 0.0507282 -0.0778742 0.0121538 -0.1175263 -0.0272476 0.1113891 -0.0091662 -0.0629145 0.0070559 0.0118651 -0.0220309 -0.0805128 -0.0002407 -0.1159805 -0.0372659 0.004795 0.0007905 0.0068103 0.1225288 0.0937672 0.006038 0.0036814 0.0733861 0.0461152 0.097387 -0.03326 0.0949602 -0.0690747 0.0889426 0.0162213 0.0091247 0.0878318 0.0204954 -0.1026379 0.037861 -0.1045227 -0.0365754 unknown
polarizability: 129.6173883|0.0397069|115.1926805|1.2468184|-9.7405419|64.0631644 unknown
InChI: InChI=1S/C8H10N2O/c1-3-8(11-4-2)7(5-9)6-10/h3-4H2,1-2H3
charge 0 multiplicity 1
21 atoms
O  1.428478 -0.853904 -0.328599
N  0.031619 2.850112 -0.699392
N  -3.359706 0.050816 -0.511554
C  -0.525561 -2.188916 -0.237976
C  0.061961 -0.800739 -0.374495
C  2.315246 0.358645 -0.360307
C  -0.706025 -2.592379 1.252376
C  3.742723 -0.161503 -0.251777
C  -0.739495 0.341222 -0.490354
C  -0.283054 1.698784 -0.599813
C  -2.168997 0.178888 -0.505479
H  0.163699 -2.89685 -0.731126
H  -1.498619 -2.236773 -0.75489
H  2.13829 0.895461 -1.308157
H  2.042933 1.012135 0.486804
H  -1.427569 -1.928361 1.759003
H  -1.089596 -3.625438 1.315097
H  0.256058 -2.547358 1.791581
H  4.445163 0.690989 -0.272236
H  3.893191 -0.713142 0.691512
H  3.984661 -0.831391 -1.09402
