program: Gaussian 09
title: 000231462
version: EM64L-G09RevD.01
frameworkgroup: C1[X(C4H8O2S)]
method: RPBEPBE
basis: SDD
operation: Freq
keyword: #pfreq=noraman
keyword: PBEPBE/SDD
title: #p freq=noraman PBEPBE/SDD
converged: YES YES YES YES
title: Mulliken charges:
elementType: S O O C C C C H H H H H H H H
charge: 0.649029 -0.236604 -0.632591 -0.600909 -0.600908 -0.284936 -0.284936 0.292499 0.259029 0.259029 0.292498 0.200511 0.243889 0.243888 0.200511
chargesum: 0.00000
title: Mulliken charges with hydrogens summed into heavy atoms:
elementType: S O O C C C C
charge: 0.649029 -0.236604 -0.632591 -0.049381 -0.049381 0.159464 0.159464
polarizability: 8.30565137e+01 2.12613043e-05 7.44976686e+01 2.96073847e+00 -4.07938328e-06 5.06443296e+01
1716.lowfreq: -24.8417 -9.1506 -0.0029 -0.0027 0.0008 15.7877 117.7040 172.3574 221.9123
frequency: 117.6437 172.3488 221.8936 264.3183 298.3446 361.7429 372.1767 495.3174 548.1389 560.8647 766.5099 786.9247 800.0716 939.8263 940.1727 964.4767 986.2726 1039.8779 1067.4624 1121.3344 1151.8360 1178.5303 1225.6120 1251.2928 1289.2100 1338.2172 1366.6347 1406.9146 1420.6584 1443.5229 1451.6434 2940.7182 2942.4624 3036.6130 3037.4507 3062.2560 3065.2027 3127.5187 3128.7916
redmass: 4.6933 2.8308 3.1329 3.6750 7.8685 2.0865 3.3874 3.6462 2.5026 3.7694 3.5917 1.6374 14.2495 1.9953 1.9357 1.5403 2.0324 2.0229 5.7559 1.2726 1.2556 1.2882 1.3724 1.1745 1.1269 1.1995 1.2467 1.1019 1.0994 1.0743 1.0879 1.0686 1.0677 1.0580 1.0574 1.0929 1.0948 1.1092 1.1092
irintensity: 14.6865 2.3395 9.0328 5.8769 0.0126 6.4516 2.0534 0.2486 24.1598 5.3627 2.8286 0.2943 55.7569 25.6883 0.0015 13.9640 5.0615 8.6485 28.8948 6.6153 14.3984 14.2444 1.5730 19.8941 0.6484 0.1263 3.2250 4.2433 26.7993 4.1642 15.3395 27.6062 97.6708 1.7534 7.6928 24.6627 13.2849 4.5623 6.9950
temp: 298.150 k
press: 1.00000 atm
elementType: 16 8 8 6 6 6 6 1 1 1 1 1 1 1 1
symmnumber: 1
zpe: 309179.7 jmol-1
zpe.correction: 0.117760 hartree
zpe.thermalcorrener: 0.125232 hartree
zpe.thermalcorrenthalpy: 0.126177 hartree
zpe.thermalcorrgfe: 0.086087 hartree
zpe.sumelectzpe: -705.056005 hartree
zpe.sumelectthermal: -705.048533 hartree
zpe.sumelectthermalent: -705.047589 hartree
zpe.sumelectthermalfe: -705.087678 hartree
dipole: 3.6698 0.0000 1.9683
dipole: 4.1644
quadrupole: -67.7127 -41.1321 -49.6071
quadrupole: 0.0000 -0.5483 0.0000
quadrupole: -14.8954 11.6852 3.2102 0.0000 -0.5483 0.0000
hfenergy: -705.1737651 hartree
pointgroup: C01 [X(C4H8O2S1)]
dipole: -1.4434239 0. -0.7751348 debye
dipolederiv: 0.9142113 0.0000146 -0.2008595 0.0000078 0.4175547 0.0000023 0.0199431 0.0000061 0.2310288 -0.536766 0.0000058 -0.0774141 0.0000048 -0.7370434 -0.0000123 -0.0458196 -0.0000118 -0.3886759 -0.7408159 -0.0000121 0.2263783 0.0000035 -0.4449007 0.000002 -0.2733825 -0.0000064 -0.3856182 -0.2002957 0.0058143 -0.0479937 0.0112289 0.0230486 -0.0161921 0.0002343 0.0012625 -0.0074392 -0.2002951 -0.0058192 -0.0479945 -0.0112369 0.0230473 0.0161923 0.0002334 -0.0012603 -0.0074378 0.3344729 -0.1813707 0.0262618 -0.2303804 0.383522 0.0697647 0.1486769 0.1924551 0.3605223 0.3344588 0.1813675 0.026276 0.2303694 0.3835536 -0.0697624 0.1486985 -0.1924488 0.3605055 0.012454 -0.0401365 -0.0088674 -0.0705801 0.0561818 -0.0309662 -0.0038003 0.0244857 -0.0533806 0.0369447 0.0655476 0.022235 0.0355165 -0.0627173 -0.0407989 0.0260551 -0.041235 0.0817015 0.0369481 -0.0655455 0.0222294 -0.0355148 -0.0627263 0.0407908 0.0260515 0.041227 0.0817066 0.0124499 0.0401356 -0.0088663 0.070579 0.0561852 0.0309727 -0.003795 -0.024479 -0.0533804 0.0553404 0.0643514 0.0052957 0.0522959 0.024291 0.0326377 -0.0579535 -0.0884029 -0.198213 -0.0572227 -0.1269614 0.0290088 -0.0467279 -0.0421453 0.02963 0.0364067 0.0464667 0.0884474 -0.0572288 0.1269592 0.0290182 0.0467251 -0.0421346 -0.0296376 0.0364115 -0.0464742 0.0884422 0.0553443 -0.0643505 0.0052923 -0.0522909 0.0242833 -0.0326229 -0.0579601 0.0884155 -0.1982092 unknown
polarizability: 83.0535261|0.0000283|74.4976686|2.9770452|0.0008178|50.6473173 unknown
InChI: InChI=1S/C4H8O2S/c5-7-3-1-6-2-4-7/h1-4H2
charge 0 multiplicity 1
15 atoms
S  1.334945 0.000052 -0.553019
O  -1.855668 -0.000031 0.329536
O  2.704008 0.000045 0.40757
C  0.208646 -1.408026 0.199638
C  0.208597 1.408044 0.199727
C  -1.253611 -1.22356 -0.218353
C  -1.253654 1.223554 -0.218274
H  0.366702 -1.313632 1.286339
H  0.645351 -2.348816 -0.174406
H  0.645269 2.348873 -0.174258
H  0.366659 1.313588 1.286422
H  -1.349291 -1.233238 -1.327488
H  -1.868524 -2.045578 0.186671
H  -1.868595 2.045525 0.186805
H  -1.349336 1.233301 -1.327408
