program: Gaussian 09
title: 000231461
version: EM64L-G09RevD.01
frameworkgroup: C1[X(C12H10N2O4)]
method: RPBEPBE
basis: SDD
operation: Freq
keyword: #p
keyword: freq=noraman
keyword: PBEPBE/SDD
title: #p freq=noraman PBEPBE/SDD
converged: YES YES NO NO
title: Mulliken charges:
elementType: O O O O N N C C C C C C C C C C C C H H H H H H H H H H
charge: -0.261148 -0.238080 -0.193121 -0.183147 0.016894 -0.013553 0.324751 0.214593 -0.326925 -0.263514 -0.356742 -0.236591 -0.204659 0.128579 -0.259567 0.193294 -0.665037 -0.210261 0.273213 0.296022 0.289410 0.249285 0.249851 0.238630 0.232313 0.222979 0.233641 0.248893
chargesum: 0.00000
title: Mulliken charges with hydrogens summed into heavy atoms:
elementType: O O O O N N C C C C C C C C C C C C
charge: -0.261148 -0.238080 -0.193121 -0.183147 0.016894 -0.013553 0.324751 0.214593 -0.053712 0.032508 -0.067332 0.012694 0.045193 0.128579 0.211376 0.193294 0.040475 -0.210261
polarizability: 2.59458313e+02 -2.03795750e+00 1.73960841e+02 -1.38445733e+01 2.07474220e+00 8.76489004e+01
1716.lowfreq: -5.3456 -0.0007 -0.0005 -0.0004 4.6277 8.7208 20.8863 34.3825 44.7107
frequency: 20.6819 34.3589 44.6712 52.8652 76.5023 90.3112 95.2632 127.2862 138.8456 192.5418 208.8362 223.4459 237.8581 291.0062 310.9092 350.9675 376.4208 387.1691 425.8931 447.3353 493.8991 500.5491 531.6269 586.1981 591.2468 650.1132 665.5713 707.9539 725.3539 731.5606 752.4214 780.9779 789.5584 810.8319 816.8171 870.8341 889.2684 926.2232 978.1261 1003.0049 1004.6048 1040.1845 1060.4590 1068.8867 1095.0603 1139.8737 1157.9247 1175.1487 1195.2871 1203.8570 1235.3712 1277.8681 1292.1572 1339.5471 1356.0406 1367.4227 1387.3346 1391.1991 1435.1180 1456.9136 1463.3293 1470.1140 1484.1263 1567.6532 1595.1795 1605.4183 1626.6951 2170.1057 2995.4062 3034.2763 3091.1622 3098.4013 3125.0999 3135.9401 3150.3004 3165.7755 3178.9101 3188.4892
redmass: 6.1431 5.1195 3.6818 9.2829 6.3083 7.2024 4.7769 4.5696 5.9317 2.8882 6.9561 1.6185 7.5419 3.9173 4.5394 5.0291 8.1075 5.1960 3.7140 4.2892 4.5842 9.4981 7.1967 6.4599 5.8849 7.0774 5.1809 4.2918 6.1340 4.2843 3.8957 2.1864 2.6729 3.6253 1.5373 3.8518 1.3601 1.4883 1.3838 2.6310 1.3556 3.0067 4.4529 3.0275 2.1741 2.0776 1.7074 1.2526 2.0093 7.9714 2.9972 1.1208 1.6834 2.2747 1.3298 4.1624 4.7897 1.2306 2.5769 1.0977 1.0443 2.5584 1.0522 6.1599 8.5227 6.9058 9.3148 12.6265 1.0360 1.0602 1.0975 1.1025 1.1067 1.0886 1.0872 1.0915 1.0955 1.0986
irintensity: 0.5404 4.4915 0.3287 2.1128 0.4462 1.3409 0.1741 2.9326 0.4432 1.0411 2.1782 5.5845 4.0327 17.7144 3.6759 7.7198 1.2581 3.8776 1.4874 2.3373 8.7957 1.7289 0.5343 7.9520 0.8569 8.9297 18.0831 8.4488 7.5186 23.5467 4.1332 36.0271 31.3592 4.4448 6.1607 21.0419 4.4520 7.6215 2.8880 38.2905 1.6017 3.8573 38.3073 125.9068 28.4340 9.5528 49.4104 80.9572 320.2947 228.8896 152.4121 9.4772 0.9121 44.2083 2.5915 109.1682 5.5818 23.3353 4.4678 16.7967 14.3676 54.5073 14.2654 31.9994 93.5307 6.3032 98.3581 8.6846 18.8602 27.8759 33.6763 2.6097 26.3259 5.6404 1.5626 8.7654 1.6894 7.3988
temp: 298.150 k
press: 1.00000 atm
elementType: 8 8 8 8 7 7 6 6 6 6 6 6 6 6 6 6 6 6 1 1 1 1 1 1 1 1 1 1
symmnumber: 1
zpe: 524933.0 jmol-1
zpe.correction: 0.199936 hartree
zpe.thermalcorrener: 0.216965 hartree
zpe.thermalcorrenthalpy: 0.217909 hartree
zpe.thermalcorrgfe: 0.152513 hartree
zpe.sumelectzpe: -872.277579 hartree
zpe.sumelectthermal: -872.260551 hartree
zpe.sumelectthermalent: -872.259607 hartree
zpe.sumelectthermalfe: -872.325003 hartree
dipole: 0.5912 2.9253 -2.4819
dipole: 3.8816
quadrupole: -74.7742 -117.9123 -107.3787
quadrupole: 17.7728 -1.4973 -7.6891
quadrupole: 25.2475 -17.8905 -7.3570 17.7728 -1.4973 -7.6891
hfenergy: -872.4775155 hartree
pointgroup: C01 [X(C12H10N2O4)]
dipole: -0.2975147 -1.4556367 -0.3532267 debye
polarizability: 256.3911894|1.1594662|153.1961536|24.3526841|-37.6917264|111.480711 unknown
InChI: InChI=1S/C12H10N2O4/c1-2-18-12(15)10(8-13)7-9-5-3-4-6-11(9)14(16)17/h3-7H,2H2,1H3
charge 0 multiplicity 1
28 atoms
O  3.471178 -0.081078 0.826436
O  2.688804 0.934437 -1.13042
O  -3.294356 2.633841 -1.3236
O  -1.134907 2.539858 -0.60503
N  -2.287162 1.994965 -0.832459
N  1.008046 -1.655123 2.5698
C  -1.347969 -0.27577 -0.198961
C  -2.470268 0.560878 -0.488976
C  -1.64021 -1.614256 0.189854
C  0.047994 0.156921 -0.38547
C  -3.800829 0.098122 -0.414108
C  -2.965132 -2.085389 0.281864
C  -4.050712 -1.231867 -0.024792
C  1.139265 -0.212651 0.370426
C  4.874802 0.333057 0.49879
C  2.487345 0.28094 -0.079175
C  5.539484 -0.69598 -0.418637
C  1.065927 -0.996577 1.572184
H  -0.81286 -2.299188 0.393343
H  0.277793 0.816222 -1.231377
H  -4.612244 0.792245 -0.647176
H  -3.148267 -3.120658 0.586436
H  -5.080259 -1.595802 0.044944
H  4.842157 1.333278 0.032557
H  5.357803 0.385127 1.486819
H  6.599615 -0.421787 -0.571808
H  5.505411 -1.703368 0.030099
H  5.046551 -0.722894 -1.404764
