program: Gaussian 09
title: 000231537
version: EM64L-G09RevD.01
frameworkgroup: C1[X(C26H20Br2O2)]
method: RPBEPBE
basis: SDD
operation: Freq
keyword: #p
keyword: freq=noraman
keyword: PBEPBE/SDD
title: #p freq=noraman PBEPBE/SDD
converged: YES YES NO NO
title: Mulliken charges:
elementType: Br Br O O C C C C C C C C C C C C C C C C C C C C C C C C C C H H H H H H H H H H H H H H H H H H H H
charge: 0.002889 0.000998 -0.467027 -0.474083 -0.008089 -0.055874 0.407481 0.404182 0.232218 0.399050 -0.402107 -0.312791 -0.366946 -0.414476 -0.384135 -0.389793 -0.393210 -0.372136 -0.193361 -0.209800 -0.203254 -0.188515 -0.250151 -0.226484 -0.241555 -0.257746 -0.231720 -0.229044 -0.230664 -0.243263 0.364651 0.362084 0.239804 0.269178 0.318000 0.247822 0.275480 0.268411 0.291593 0.284086 0.247680 0.248314 0.250421 0.247720 0.234918 0.223348 0.237657 0.225303 0.236389 0.226549
chargesum: 0.00000
title: Mulliken charges with hydrogens summed into heavy atoms:
elementType: Br Br O O C C C C C C C C C C C C C C C C C C C C C C C C C C
charge: 0.002889 0.000998 -0.102376 -0.112000 -0.008089 -0.055874 0.407481 0.404182 0.232218 0.399050 -0.162302 -0.043614 -0.048945 -0.166655 -0.108656 -0.121382 -0.101617 -0.088051 0.054320 0.038514 0.047167 0.059205 -0.015233 -0.003136 -0.003898 -0.032443 -0.231720 -0.229044 0.005724 -0.016714
polarizability: 4.29354544e+02 3.46121151e+01 2.85764531e+02 -1.01984841e+01 1.17659640e+01 2.36264759e+02
1716.lowfreq: -6.8527 -5.2282 -3.7866 -0.0007 -0.0005 0.0001 14.6029 23.3773 29.6875
frequency: 14.4162 23.2639 29.5953 37.7795 49.2051 51.1428 57.1165 68.5891 69.9482 101.7676 119.3551 128.8662 147.3671 167.9189 194.4042 197.8466 208.8690 224.7635 240.2695 270.3515 285.2174 294.7184 316.3393 322.0897 324.7241 346.1373 348.7902 384.9135 397.0475 403.4961 405.2968 407.1587 410.7406 436.0216 463.5749 487.4247 490.3371 522.5015 539.8100 582.1125 614.6507 615.6960 616.7947 623.6666 625.1001 653.4937 660.1398 693.8876 708.0731 713.6165 718.0098 719.3537 750.3651 765.4296 798.2770 815.9950 827.0903 840.1371 842.8563 853.1237 865.3861 867.6460 922.5569 929.8205 942.7331 953.9243 960.0541 963.5663 968.0376 975.5762 986.6226 988.8777 990.8645 991.7502 992.8901 995.3450 997.8664 1002.0324 1006.2805 1011.6727 1030.6103 1032.0081 1065.6773 1065.6967 1088.7801 1090.4783 1117.8265 1123.7682 1154.6709 1160.3361 1167.9676 1173.3730 1175.9192 1191.5407 1194.9436 1197.0475 1197.2713 1200.7544 1267.4558 1295.9392 1297.2802 1307.1100 1321.9928 1328.2076 1359.2816 1360.9624 1376.4603 1378.7482 1383.3046 1386.0446 1433.1073 1436.5842 1467.9960 1468.8334 1476.7157 1482.8604 1574.1306 1574.7694 1584.5680 1587.5097 1590.2402 1591.3766 1605.4240 1612.5311 3123.5404 3130.7087 3134.6230 3139.2733 3151.1718 3151.4255 3152.0604 3153.7320 3154.4640 3159.2382 3160.5168 3162.6902 3169.8427 3170.3128 3173.6963 3173.8203 3174.1350 3193.0026 3497.2556 3558.2727
redmass: 9.8575 8.8248 6.2226 5.8652 4.1221 4.5505 4.1057 4.0893 5.1725 8.9864 7.6927 8.3272 7.0170 7.6746 5.0262 1.7794 6.9437 6.5909 5.1944 5.5680 5.8624 3.7651 4.9534 4.4000 5.1302 4.1939 4.6570 6.3843 3.3134 3.0559 2.9217 2.8928 2.7850 1.3715 4.6898 3.9711 3.4721 3.4735 3.7412 5.9644 6.0573 5.7927 6.3162 6.9992 7.0460 6.0927 5.7736 6.6940 2.2384 1.9275 4.1106 3.0349 2.0331 1.8468 1.9289 1.5608 1.2732 1.3604 4.8004 1.8662 1.2618 1.2413 2.3293 1.8731 1.4800 1.4671 1.5500 2.7340 1.6292 4.2584 2.7982 3.8490 2.7351 1.8152 2.0735 4.6191 1.8451 1.3907 1.5535 2.0255 2.2955 2.1858 2.6342 2.5812 1.6309 1.6249 1.3821 1.3981 2.0599 3.3008 3.2955 1.0634 1.0532 1.2807 1.1796 1.3613 1.2611 1.5368 1.4814 1.2871 1.2513 1.7275 1.3705 1.3379 5.9547 5.0640 7.5954 7.6510 3.7359 3.4244 2.2203 2.2476 2.2228 2.2691 2.1120 2.1972 7.6290 7.4588 5.9660 6.1542 6.2045 6.1287 5.9619 5.9251 1.0849 1.0852 1.0895 1.0883 1.0874 1.0923 1.0942 1.0874 1.0890 1.0953 1.0904 1.0966 1.0967 1.1003 1.0963 1.0970 1.0966 1.0943 1.0649 1.0663
irintensity: 0.1159 0.0717 0.2958 0.0940 0.3401 2.4808 0.1352 0.3564 0.1709 0.5832 0.3875 0.7586 0.8923 6.6863 2.8311 113.9347 0.2906 2.3626 2.8427 1.9899 4.4877 23.9198 1.4193 4.4418 4.1075 6.0710 7.0519 66.0448 27.7199 2.0107 7.6407 1.3245 12.5378 117.9332 55.9309 3.1287 20.7966 2.0827 4.0345 4.4446 17.3447 16.6688 1.0859 2.8607 0.1003 0.8376 18.6053 0.9504 37.6881 32.9514 5.5203 10.2448 137.8458 55.8627 51.7473 8.3526 0.8029 0.4754 55.5032 42.1112 1.3695 1.0081 52.9892 3.0520 3.7059 1.6821 6.7927 34.0828 19.2267 25.9211 8.5558 6.2477 4.5009 0.6443 1.9952 95.0001 5.0800 2.1989 1.1188 0.8324 20.4614 1.8002 60.0705 0.9222 0.4479 3.8099 1.6194 3.6942 20.6203 3.4283 10.5767 0.2047 0.5160 4.2709 5.4042 9.8409 3.9700 3.1217 63.0449 11.3554 1.6654 45.7695 0.1916 14.9413 1.7632 6.4918 1.7991 0.3379 9.6439 6.6574 13.1075 15.1092 46.2206 142.7007 15.7140 23.9632 0.8050 1.4652 3.2350 15.1334 1.3141 19.9911 1.9755 6.6988 0.0379 0.0398 17.1209 4.3707 2.3430 9.9760 22.9098 1.5395 3.1257 12.9402 3.5153 16.1365 12.0655 18.7363 8.9630 5.2396 10.4628 1.3708 28.6075 12.4431
temp: 298.150 k
press: 1.00000 atm
elementType: 35 35 8 8 6 6 6 6 6 6 6 6 6 6 6 6 6 6 6 6 6 6 6 6 6 6 6 6 6 6 1 1 1 1 1 1 1 1 1 1 1 1 1 1 1 1 1 1 1 1
symmnumber: 1
zpe: 994111.3 jmol-1
zpe.correction: 0.378637 hartree
zpe.thermalcorrener: 0.405409 hartree
zpe.thermalcorrenthalpy: 0.406353 hartree
zpe.thermalcorrgfe: 0.318387 hartree
zpe.sumelectzpe: -1178.034334 hartree
zpe.sumelectthermal: -1178.007562 hartree
zpe.sumelectthermalent: -1178.006618 hartree
zpe.sumelectthermalfe: -1178.094584 hartree
dipole: 0.1919 3.4056 -0.2555
dipole: 3.4206
quadrupole: -222.4502 -177.1689 -179.3139
quadrupole: 5.6626 0.3717 2.8678
quadrupole: -29.4725 15.8088 13.6638 5.6626 0.3717 2.8678
hfenergy: -1178.4129706 hartree
pointgroup: C01 [X(C26H20Br2O2)]
dipole: 0.1497097 1.3374073 0.0002531 debye
polarizability: 432.1498592|27.5671959|280.1611756|-13.04545|14.9793568|239.0727988 unknown
InChI: InChI=1S/C26H20Br2O2/c27-23-15-11-21(12-16-23)25(29,19-7-3-1-4-8-19)26(30,20-9-5-2-6-10-20)22-13-17-24(28)18-14-22/h1-18,29-30H
charge 0 multiplicity 1
50 atoms
Br -6.692391 0.205633 -0.175635
Br 6.649457 -0.737248 -0.828259
O  0.046784 0.483312 -1.851127
O  0.238222 -0.132208 1.834018
C  -0.367567 0.646451 -0.439395
C  0.424892 -0.481939 0.410745
C  -1.903895 0.48416 -0.350617
C  1.942116 -0.522516 0.084903
C  0.08336 2.052729 0.038266
C  -0.149004 -1.902213 0.244439
C  -2.694348 0.796517 -1.483567
C  2.419392 -0.95552 -1.180452
C  -2.566614 0.079738 0.836975
C  2.892938 -0.193607 1.080981
C  -0.707917 2.845527 0.911332
C  -0.117907 -2.78698 1.35086
C  1.33124 2.573977 -0.407936
C  -0.634872 -2.373041 -1.000758
C  -4.104375 0.71916 -1.444564
C  3.801632 -1.016537 -1.457425
C  -3.974594 -0.009739 0.893315
C  4.282232 -0.253804 0.824137
C  -0.26992 4.125563 1.320213
C  -0.570862 -4.117536 1.216876
C  1.76454 3.854485 -0.000566
C  -1.086381 -3.704363 -1.132086
C  -4.730813 0.318148 -0.24879
C  4.720963 -0.656251 -0.450515
C  0.966056 4.636561 0.86465
C  -1.055805 -4.584128 -0.026352
H  0.115772 1.378966 -2.267649
H  0.4833 0.824323 1.950079
H  -2.21225 1.077495 -2.424333
H  1.71228 -1.246319 -1.959053
H  -1.977392 -0.185044 1.718926
H  2.558004 0.086393 2.083691
H  -1.678874 2.473929 1.251874
H  0.251774 -2.42288 2.313268
H  1.972097 1.970183 -1.058421
H  -0.675757 -1.699239 -1.861784
H  -4.697147 0.961455 -2.331353
H  4.152883 -1.34978 -2.438266
H  -4.467472 -0.335164 1.813857
H  5.000747 0.003426 1.607559
H  -0.89988 4.72411 1.987281
H  -0.543963 -4.789194 2.082555
H  2.728953 4.235564 -0.353791
H  -1.467173 -4.051838 -2.099191
H  1.301908 5.631043 1.178034
H  -1.407364 -5.616758 -0.130855
