program: Gaussian 09
title: 000231454
version: EM64L-G09RevD.01
frameworkgroup: C1[X(C12H13N3O3)]
method: RPBEPBE
basis: SDD
operation: Freq
keyword: #p
keyword: freq=noraman
keyword: PBEPBE/SDD
title: #p freq=noraman PBEPBE/SDD
converged: YES YES NO NO
title: Mulliken charges:
elementType: O O O N N N C C C C C C C C C C C C H H H H H H H H H H H H H
charge: -0.195558 -0.196199 -0.220864 -0.380029 -0.378731 -0.695538 -0.057962 -0.432576 0.492938 0.162285 0.163543 -0.734729 -0.329966 -0.386322 0.153367 -0.452366 -0.443452 0.515858 0.238415 0.237451 0.232489 0.231378 0.225301 0.221845 0.246668 0.362338 0.362319 0.220388 0.219300 0.309403 0.309006
chargesum: 0.00000
title: Mulliken charges with hydrogens summed into heavy atoms:
elementType: O O O N N N C C C C C C C C C C C C
charge: -0.195558 -0.196199 -0.220864 -0.017692 -0.016412 -0.077129 -0.057962 0.043289 0.492938 0.162285 0.163543 -0.045561 -0.108121 -0.139654 0.153367 -0.231977 -0.224152 0.515858
polarizability: 2.06714532e+02 7.83672698e+00 1.63341335e+02 5.68923679e-02 3.46560654e-01 1.14533435e+02
1716.lowfreq: 0.0005 0.0006 0.0007 5.4369 11.1914 11.5598 21.0933 40.7233 63.2253
frequency: 19.7578 40.7108 63.2247 115.5402 122.5130 139.2687 157.3819 163.2895 180.8097 214.7076 235.4197 313.7201 315.9300 347.6707 361.6398 366.3029 383.8260 385.5158 390.8454 407.8821 454.6754 479.0061 508.9385 519.7865 584.7125 627.0719 639.5418 649.6413 658.2968 691.7587 713.8888 729.9964 752.4873 784.7770 784.9578 812.7284 823.0209 824.8702 895.5671 925.2660 945.9332 959.4297 962.3519 992.0765 1000.5301 1020.6594 1083.5054 1118.2114 1136.9113 1150.3389 1165.8816 1200.2821 1203.1601 1280.2816 1298.7692 1321.3026 1322.4164 1332.6609 1363.9063 1373.0032 1376.2178 1380.5268 1401.9235 1438.6198 1455.1310 1482.6469 1492.2586 1516.6286 1578.6795 1618.2474 1632.3594 1646.1846 1654.6506 1673.0720 2984.7465 3018.0609 3068.9678 3082.2470 3094.7942 3118.5137 3123.9806 3142.4676 3170.8354 3517.4463 3519.3441 3565.4288 3705.0425
redmass: 3.7598 9.8470 5.4616 2.5268 5.1429 5.7666 6.3781 4.4135 6.0401 1.3712 5.6902 1.8672 4.0668 5.5069 5.0617 6.7526 1.1912 1.2229 3.5480 2.7499 4.4866 9.7746 6.0185 2.4848 9.0144 3.9163 6.8684 2.4945 3.4650 4.4226 4.8667 2.6802 1.8356 1.4667 1.6083 1.2802 1.8122 5.3592 5.8636 1.6199 1.5349 1.5336 2.1697 3.3485 3.0006 1.4427 3.0044 2.3332 2.3004 1.4248 3.7354 4.5397 1.1192 3.7742 1.2364 1.9861 1.4400 1.8062 9.4999 2.0864 1.4416 4.3075 1.2090 3.5228 1.1141 1.0510 1.0399 2.8210 6.5606 7.1543 2.4866 1.6224 9.1531 5.2359 1.0361 1.0594 1.1007 1.0981 1.1038 1.0867 1.0895 1.0959 1.0935 1.0756 1.0781 1.0450 1.1040
irintensity: 0.1428 0.9088 1.8447 0.0643 3.9706 0.2124 7.3463 2.3053 2.2008 0.0994 0.5305 0.9303 1.3895 42.0842 0.3554 12.8627 139.3188 162.4594 2.2499 0.1029 9.9939 13.8568 14.9335 16.0591 0.3704 0.8165 0.2382 7.4238 21.8508 13.8987 11.5050 0.1320 0.4308 36.4444 196.9025 0.2013 74.2458 5.3039 10.4891 0.8276 1.4970 1.0940 7.0093 4.7222 2.6530 0.7875 5.0976 10.3615 2.5463 7.4300 5.7361 45.2771 48.5124 351.6641 13.4354 51.1353 16.3658 33.2935 245.9226 4.3539 10.8001 1.5957 16.0996 0.4386 18.3075 7.1515 17.1722 134.7998 3.3172 309.5499 16.6254 346.1257 64.0375 609.6139 27.2688 15.4399 5.5112 33.0071 20.1269 12.6832 25.7091 16.8993 7.6400 84.5455 42.4443 92.5728 22.3510
temp: 298.150 k
press: 1.00000 atm
elementType: 8 8 8 7 7 7 6 6 6 6 6 6 6 6 6 6 6 6 1 1 1 1 1 1 1 1 1 1 1 1 1
symmnumber: 1
zpe: 629699.8 jmol-1
zpe.correction: 0.239840 hartree
zpe.thermalcorrener: 0.256386 hartree
zpe.thermalcorrenthalpy: 0.257330 hartree
zpe.thermalcorrgfe: 0.195313 hartree
zpe.sumelectzpe: -853.754688 hartree
zpe.sumelectthermal: -853.738142 hartree
zpe.sumelectthermalent: -853.737198 hartree
zpe.sumelectthermalfe: -853.799215 hartree
dipole: 4.1834 -0.1893 0.0066
dipole: 4.1877
quadrupole: -81.3147 -102.8430 -119.1987
quadrupole: -8.7259 0.0854 0.1395
quadrupole: 19.8041 -1.7242 -18.0799 -8.7259 0.0854 0.1395
hfenergy: -853.9945282 hartree
pointgroup: C01 [X(C12H13N3O3)]
dipole: -1.6379544 0.1774149 0.0094828 debye
polarizability: 207.5245434|5.0631893|162.5223099|-0.1302984|0.7269262|114.5424486 unknown
InChI: InChI=1S/C12H13N3O3/c1-2-12(7-3-5-8(13)6-4-7)9(16)14-11(18)15-10(12)17/h3-6,14-15H,2,13H2,1H3
charge 0 multiplicity 1
31 atoms
O  1.073223 -0.694612 -2.447515
O  1.064843 -0.823504 2.405099
O  3.199742 2.576607 0.071072
N  2.049573 0.952402 -1.156032
N  2.043471 0.891286 1.206762
N  -4.901291 1.058828 0.031668
C  0.622415 -0.789623 -0.022807
C  0.769112 -2.339835 -0.063916
C  -0.863135 -0.315039 -0.010203
C  1.256654 -0.20571 -1.30552
C  1.253444 -0.275365 1.291172
C  2.233741 -2.82414 -0.083511
C  -1.168992 1.072305 0.006314
C  -1.94544 -1.228315 -0.01112
C  2.475721 1.549911 0.042864
C  -2.495643 1.53364 0.020207
C  -3.279285 -0.78082 0.002776
C  -3.581922 0.611011 0.018572
H  0.249057 -2.701479 -0.968229
H  0.259172 -2.747787 0.826304
H  2.772229 -2.460341 -0.977414
H  2.782822 -2.501063 0.81969
H  2.264234 -3.927808 -0.108646
H  -0.366194 1.819213 0.007727
H  -1.76154 -2.305636 -0.022854
H  2.400804 1.386698 -2.016081
H  2.389033 1.280978 2.090119
H  -2.696948 2.611621 0.032087
H  -4.095864 -1.513077 0.001298
H  -5.675448 0.401324 0.031448
H  -5.114888 2.051731 0.043867
