program: Gaussian 09
title: 000231452
version: EM64L-G09RevD.01
frameworkgroup: C1[X(C17H15NO3)]
method: RPBEPBE
basis: SDD
operation: Freq
keyword: #p
keyword: freq=noraman
keyword: PBEPBE/SDD
title: #p freq=noraman PBEPBE/SDD
converged: YES YES NO NO
title: Mulliken charges:
elementType: O O O N C C C C C C C C C C C C C C C C C H H H H H H H H H H H H H H H
charge: -0.136984 -0.213982 -0.261571 -0.267576 -0.267497 -0.546009 0.498349 0.050681 0.078823 0.442038 -0.441244 -0.331810 -0.353424 -0.338180 -0.354554 -0.356839 0.321408 -0.228458 -0.243762 -0.243820 -0.537298 0.255828 0.268055 0.280040 0.231780 0.249747 0.309881 0.253258 0.243077 0.256332 0.231116 0.227014 0.231860 0.222322 0.221614 0.249786
chargesum: 0.00000
title: Mulliken charges with hydrogens summed into heavy atoms:
elementType: O O O N C C C C C C C C C C C C C C C C C
charge: -0.136984 -0.213982 -0.261571 -0.267576 -0.011669 0.002085 0.498349 0.050681 0.078823 0.442038 -0.209464 -0.082062 -0.043544 -0.084923 -0.111477 -0.100507 0.321408 0.002658 -0.016748 -0.011959 0.156425
polarizability: 2.34177189e+02 4.89004377e+00 2.27917846e+02 -2.22084990e+01 -8.47203588e+00 1.50055428e+02
1716.lowfreq: -6.8673 -4.8813 -0.0009 -0.0008 -0.0004 0.5431 22.5745 25.9601 43.5109
frequency: 22.5289 25.9153 43.4901 51.8278 65.0528 90.5444 128.8563 146.0397 161.8030 201.1853 204.8470 242.2456 294.2393 310.3685 313.1045 335.0269 368.6540 396.1241 405.7135 413.1214 425.3550 441.3721 519.2079 530.5132 547.1113 595.5025 612.1918 620.8668 627.4770 646.0709 671.0235 692.7275 719.6074 737.4960 767.0389 777.5939 805.3164 815.1612 838.7496 841.7770 851.8797 921.3489 935.4863 947.5882 969.1982 977.7540 984.9949 986.6396 999.1264 1004.0639 1013.7814 1034.7469 1061.1446 1076.5521 1106.7019 1112.1760 1117.6523 1130.8375 1157.0196 1175.6602 1178.2499 1183.7039 1201.6202 1215.7054 1235.4704 1247.5968 1282.5277 1290.6164 1320.2689 1331.2306 1344.2278 1382.2550 1391.4427 1420.3156 1428.4276 1436.0978 1447.3175 1467.0933 1471.8884 1485.3396 1502.1188 1584.1098 1585.6159 1609.9035 1618.9691 1623.5503 1672.3066 2961.2084 3001.0757 3014.4079 3049.8982 3097.3385 3111.6647 3129.0248 3131.5098 3138.2620 3142.7860 3162.3415 3162.6992 3171.2397 3178.9504 3193.4860
redmass: 4.5692 4.2433 4.2176 5.3965 7.9789 4.1451 3.7916 5.1820 4.7382 2.2874 3.0258 1.5440 4.2269 6.4056 5.6690 11.2205 6.4114 4.4142 2.9351 2.9979 5.7309 4.2833 3.1081 3.5164 3.9849 4.7520 5.6611 5.5638 7.0807 3.8858 5.2762 1.9466 4.1929 3.7147 2.2529 3.7492 5.1788 1.3447 1.4015 1.3775 6.8145 1.4198 1.4787 2.2627 1.3605 1.4098 5.1292 8.5652 2.9199 1.3152 2.9320 2.3622 3.1272 3.5558 1.8906 1.2596 1.4301 1.3595 1.3238 1.2407 1.4003 1.9855 1.2046 1.8112 3.4261 1.7128 1.9415 1.4429 1.6289 1.5560 1.8951 7.5090 3.3905 2.5190 1.1906 1.1701 2.4359 1.0508 1.0745 2.2207 2.4337 6.0778 6.9104 5.8929 10.7284 6.5549 12.6193 1.0330 1.0727 1.0788 1.1040 1.0965 1.0894 1.0994 1.0854 1.0891 1.0907 1.0962 1.0936 1.0956 1.0954 1.0952
irintensity: 1.1732 0.9272 0.4500 2.4450 1.3618 2.8375 1.8041 5.4597 0.2993 0.8842 1.8424 0.3914 1.7599 2.6707 2.2801 2.8240 2.9524 4.2774 0.0687 0.9517 5.5017 2.3558 16.8843 15.9486 4.6461 15.2984 0.1850 1.2452 0.5921 6.0485 3.9342 45.4363 4.8570 2.3865 46.5183 28.0649 6.0535 21.9372 27.2844 17.8571 2.3152 10.4885 2.8704 9.2617 0.5183 0.3809 0.4248 40.9626 7.8803 2.1158 8.3041 4.5059 67.7489 7.5954 7.8219 0.1634 10.2777 5.4252 1.6955 33.1906 117.4184 18.8837 0.3632 6.3711 192.0656 28.1172 48.6251 11.3282 7.8315 8.2085 15.3093 0.9091 21.7591 8.2964 10.7295 8.9260 9.4679 14.6152 57.9688 59.2660 108.3864 0.1783 7.6561 9.3544 265.0520 34.2439 337.5407 66.4895 9.5164 17.3498 45.3957 4.2936 15.9620 21.3981 0.3379 6.8020 16.8622 35.3742 10.6791 2.8330 6.8524 10.8291
temp: 298.150 k
press: 1.00000 atm
elementType: 8 8 8 7 6 6 6 6 6 6 6 6 6 6 6 6 6 6 6 6 6 1 1 1 1 1 1 1 1 1 1 1 1 1 1 1
symmnumber: 1
zpe: 733436.8 jmol-1
zpe.correction: 0.279351 hartree
zpe.thermalcorrener: 0.297373 hartree
zpe.thermalcorrenthalpy: 0.298317 hartree
zpe.thermalcorrgfe: 0.231169 hartree
zpe.sumelectzpe: -935.738102 hartree
zpe.sumelectthermal: -935.720080 hartree
zpe.sumelectthermalent: -935.719136 hartree
zpe.sumelectthermalfe: -935.786284 hartree
dipole: -5.3777 -4.4055 4.7569
dipole: 8.4235
quadrupole: -112.2473 -132.9182 -117.9180
quadrupole: -9.8602 -2.2374 6.8034
quadrupole: 8.7805 -11.8904 3.1099 -9.8602 -2.2374 6.8034
hfenergy: -936.017453 hartree
pointgroup: C01 [X(C17H15N1O3)]
dipole: 2.0239035 -1.7787368 -1.9295157 debye
polarizability: 233.318194|-4.5608215|227.9016243|-22.7787172|11.0456066|150.9306442 unknown
InChI: InChI=1S/C17H15NO3/c1-21-14-9-7-12(8-10-14)15-11-16(19)17(20)18(15)13-5-3-2-4-6-13/h2-10,15H,11H2,1H3
charge 0 multiplicity 1
36 atoms
O  -1.440245 4.096345 0.399293
O  -3.002073 1.725202 1.280453
O  4.758838 -0.744263 1.038365
N  -1.51125 0.595917 -0.22392
C  -0.332246 0.944958 -1.085429
C  -0.377575 2.498973 -1.183701
C  1.000898 0.439557 -0.526098
C  -1.290471 2.941657 -0.05055
C  -2.05664 1.705612 0.447628
C  -1.980007 -0.75453 -0.133107
C  2.03263 0.068822 -1.417652
C  1.260245 0.395955 0.868417
C  -3.130995 -1.082689 0.640276
C  -1.304945 -1.788059 -0.842028
C  3.304458 -0.330713 -0.948231
C  2.517416 -0.001899 1.354001
C  3.546852 -0.364231 0.447818
C  -3.588769 -2.415308 0.683966
C  -1.778057 -3.114413 -0.78723
C  -2.923739 -3.43997 -0.02687
C  5.857685 -1.129058 0.14804
H  -0.48841 0.500965 -2.086287
H  -0.828178 2.823514 -2.141344
H  0.618364 2.961808 -1.106356
H  1.84961 0.091099 -2.500115
H  0.472079 0.658948 1.582778
H  -3.647987 -0.298975 1.195783
H  -0.399837 -1.576083 -1.415507
H  4.080989 -0.612422 -1.665416
H  2.726163 -0.044426 2.427085
H  -4.475646 -2.649962 1.282859
H  -1.242219 -3.895882 -1.337178
H  -3.28683 -4.472284 0.014996
H  6.15044 -0.291536 -0.51463
H  5.588887 -2.012159 -0.463667
H  6.69277 -1.381773 0.81716
