program: Gaussian 09
title: 000231448
version: EM64L-G09RevD.01
frameworkgroup: C1[X(C11H16O4)]
method: RPBEPBE
basis: SDD
operation: Freq
keyword: #pfreq=noraman
keyword: PBEPBE/SDD
title: #p freq=noraman PBEPBE/SDD
converged: NO NO NO NO
title: Mulliken charges:
elementType: O O O O C C C C C C C C C C C H H H H H H H H H H H H H H H H
charge: -0.285269 -0.330515 -0.282551 -0.444818 0.253384 -0.498693 0.201429 0.043645 -0.012394 0.320831 -0.550250 -0.689339 -0.524344 -0.515302 -0.532571 0.253935 0.212917 0.262690 0.202350 0.213005 0.250904 0.378077 0.232725 0.217115 0.226335 0.264728 0.213229 0.227224 0.229242 0.222319 0.239962
chargesum: 0.00000
title: Mulliken charges with hydrogens summed into heavy atoms:
elementType: O O O O C C C C C C C C C C C
charge: -0.285269 -0.330515 -0.282551 -0.066741 0.253384 -0.031841 0.201429 0.043645 -0.012394 0.320831 -0.287560 -0.023079 0.151830 0.189880 0.158952
polarizability: 1.83726961e+02 1.15330316e+00 1.53740465e+02 -2.68325057e+00 2.02146652e+00 8.16676386e+01
1716.lowfreq: -58.2557 -9.5181 -0.0007 -0.0007 -0.0006 3.7350 8.4664 64.1422 69.8502
frequency: -58.1530 64.1339 69.8160 103.8538 115.3822 119.6956 170.4501 177.0029 184.6800 197.1370 202.6256 213.2266 257.1472 262.3796 279.8486 303.1275 329.6733 353.7800 370.0996 376.4725 449.0253 474.8631 495.7769 533.7560 580.7000 607.4418 654.8508 664.2439 690.0379 742.2036 763.0537 798.4643 820.4770 898.5369 926.0152 961.1290 1008.5526 1041.7085 1066.4070 1091.4206 1102.2274 1112.8572 1113.6956 1116.9672 1152.7286 1159.5073 1166.4023 1197.2973 1202.8049 1233.5981 1272.7862 1311.5952 1328.8274 1386.0556 1390.7359 1407.8575 1432.7333 1437.8941 1451.0831 1453.0028 1463.2367 1464.5552 1469.3870 1473.3322 1475.3464 1484.1469 1487.0497 1496.8729 1502.2027 1584.1966 1624.3488 2965.3128 2974.4261 2975.4802 2976.9242 3022.0994 3055.1526 3067.4172 3072.7204 3078.7067 3085.4062 3099.7757 3106.8647 3124.1249 3126.8572 3182.4606 3434.4048
redmass: 2.9857 3.4989 3.0559 3.7145 2.6822 3.0061 1.4768 2.3273 3.2337 1.3136 2.0417 2.9963 3.1701 1.6365 1.1407 3.7260 4.2972 3.3777 3.8774 3.9523 5.4748 5.9341 5.0021 7.3762 3.4176 1.1264 7.2687 4.7103 3.3781 3.7209 2.4597 1.5949 1.8657 6.0390 5.3330 3.2863 3.5436 3.6957 2.0121 2.3129 1.3567 1.9296 1.2647 1.4972 1.4052 1.4194 1.7820 1.7040 3.6223 1.5340 1.3116 2.0942 1.9664 1.2180 6.9278 2.0490 1.2114 1.3728 1.4602 1.0738 1.0813 1.0501 1.0535 1.0645 1.1145 1.0530 1.0587 2.5483 1.1049 9.4690 7.2970 1.0323 1.0318 1.0332 1.0353 1.0668 1.1040 1.0972 1.1030 1.0985 1.0980 1.1001 1.0993 1.1003 1.1050 1.0902 1.0634
irintensity: 5.0825 3.5697 6.8196 2.4783 2.1613 0.8287 1.4187 2.8677 1.9990 1.4857 2.7953 2.3354 2.0051 0.5952 1.8211 9.3437 0.4499 8.0742 0.6365 5.8610 14.0170 1.7161 1.1352 1.6742 0.9943 119.9386 6.1275 10.9759 5.2901 2.9241 9.2133 32.3022 38.5527 11.8072 3.9276 41.5624 91.4774 52.0739 1.4021 209.1136 21.9997 72.4024 1.1544 26.6546 1.8213 16.7888 68.4484 111.9506 32.3567 67.1209 28.9463 43.5812 27.4955 14.9744 23.6823 69.9964 31.9299 27.2215 28.4069 14.5758 12.7167 13.0347 8.3365 7.1620 64.3710 21.4238 14.2186 125.2134 12.6005 82.5010 129.2248 65.7009 138.0072 35.8231 29.4052 14.6825 43.1279 39.0200 58.7072 8.9641 35.6590 66.9447 13.5337 23.3412 17.4648 1.9067 76.1525
temp: 298.150 k
press: 1.00000 atm
elementType: 8 8 8 8 6 6 6 6 6 6 6 6 6 6 6 1 1 1 1 1 1 1 1 1 1 1 1 1 1 1 1
symmnumber: 1
zpe: 662268.6 jmol-1
zpe.correction: 0.252245 hartree
zpe.thermalcorrener: 0.268066 hartree
zpe.thermalcorrenthalpy: 0.269010 hartree
zpe.thermalcorrgfe: 0.210204 hartree
zpe.sumelectzpe: -728.440141 hartree
zpe.sumelectthermal: -728.424320 hartree
zpe.sumelectthermalent: -728.423376 hartree
zpe.sumelectthermalfe: -728.482182 hartree
dipole: -0.4773 1.4492 1.5077
dipole: 2.1450
quadrupole: -72.9833 -83.5612 -92.1524
quadrupole: 0.7817 -4.2299 -1.6129
quadrupole: 9.9156 -0.6622 -9.2534 0.7817 -4.2299 -1.6129
hfenergy: -728.6923855 hartree
pointgroup: C01 [X(C11H16O4)]
dipole: 0.2214336 0.5928626 -0.5582718 debye
polarizability: 183.7292734|-1.714785|153.8303039|1.1079235|1.3149084|81.5754865 unknown
InChI: InChI=1S/C11H16O4/c1-5-7-8(13-2)6-9(14-3)11(15-4)10(7)12/h6,12H,5H2,1-4H3
charge 0 multiplicity 1
31 atoms
O  -1.898943 2.228779 -0.142015
O  2.163932 -1.666006 0.210586
O  2.782865 1.147228 0.03364
O  -0.36248 -2.486375 0.192139
C  -1.28913 -0.245089 0.054425
C  -2.652008 -0.92864 0.137854
C  -0.996798 1.145048 -0.045366
C  -0.15183 -1.103373 0.095852
C  1.185978 -0.648091 0.066001
C  1.435579 0.746246 0.012781
C  0.341661 1.627418 -0.061077
C  -3.158852 -1.474833 -1.223674
C  -3.347359 2.077817 -0.273245
C  3.232823 -1.703146 -0.811909
C  3.049102 2.588315 0.036861
H  -2.542635 -1.791249 0.819224
H  -3.406527 -0.267251 0.590397
H  0.47376 2.709117 -0.132263
H  -3.290392 -0.66925 -1.97002
H  -4.127634 -1.993825 -1.10084
H  -2.431837 -2.198381 -1.631984
H  0.541216 -2.902897 0.278739
H  -3.700956 3.080843 -0.561113
H  -3.816713 1.79209 0.685559
H  -3.620993 1.352332 -1.060064
H  3.837172 -0.783529 -0.756908
H  2.79914 -1.811421 -1.825022
H  3.842931 -2.585017 -0.562468
H  2.587101 3.075269 0.916702
H  2.678919 3.067804 -0.889782
H  4.144108 2.678163 0.092086
