program: Gaussian 09
title: 000231442
version: EM64L-G09RevD.01
frameworkgroup: C1[X(C12H18N4S)]
method: RPBEPBE
basis: SDD
operation: Freq
keyword: #p
keyword: freq=noraman
keyword: PBEPBE/SDD
title: #p freq=noraman PBEPBE/SDD
converged: NO YES NO NO
title: Mulliken charges:
elementType: S N N N N C C C C C C C C C C C C H H H H H H H H H H H H H H H H H H
charge: 0.229843 -0.006317 -0.383260 -0.015551 0.005534 -0.367605 -0.369924 -0.351787 -0.350867 -0.355872 -0.662232 -0.694993 -0.304915 0.242601 0.107131 -0.400934 -0.366275 0.190871 0.190914 0.195963 0.195993 0.188579 0.188596 0.213205 0.213150 0.195501 0.195486 0.283639 0.283645 0.210110 0.210113 0.216577 0.275585 0.347494 0.250001
chargesum: 0.00000
title: Mulliken charges with hydrogens summed into heavy atoms:
elementType: S N N N N C C C C C C C C C C C C
charge: 0.229843 -0.006317 -0.035765 -0.015551 0.005534 0.014180 0.022032 0.025389 0.075487 0.035115 -0.094948 -0.058192 -0.304915 0.242601 0.107131 -0.125349 -0.116274
polarizability: 2.73240007e+02 -7.61503678e-01 1.72372495e+02 -5.43339785e-02 1.13144895e-02 9.95789728e+01
1716.lowfreq: -0.0004 0.0008 0.0027 4.2610 5.3454 12.5406 17.5910 32.3734 47.5167
frequency: 17.4724 32.3708 46.0779 49.5686 78.9750 90.7109 103.8835 126.1125 131.7075 144.9799 151.4631 179.9142 219.7347 228.4933 266.4895 278.3507 318.0526 398.5370 432.8012 459.7077 484.0024 529.3863 571.9476 615.0905 625.3875 650.6822 658.2981 694.6207 725.3617 733.6566 757.9582 788.1723 800.8138 817.4405 845.2147 888.6630 903.6564 904.1304 929.7166 962.9047 990.7937 997.4482 1023.6118 1030.3487 1049.5658 1071.8703 1073.1461 1080.0621 1114.4368 1121.4313 1187.0786 1198.6603 1215.3299 1223.5423 1224.6998 1253.8342 1265.1169 1268.2661 1284.2792 1295.1368 1295.2927 1298.7673 1301.4268 1334.4024 1344.4482 1353.9144 1356.0334 1384.7185 1387.5552 1391.2454 1413.6575 1440.6657 1464.6626 1464.8099 1470.3272 1476.8629 1477.5353 1484.3669 1489.6831 1522.5707 1556.7670 2954.1885 2957.2609 2964.3985 2970.3372 2973.6785 2981.6051 2990.0033 3001.6213 3017.2379 3033.6585 3042.4605 3048.6053 3070.2283 3072.7398 3120.1407 3170.3746 3231.5588 3618.1192
redmass: 5.4727 5.2056 1.7399 4.2859 1.7135 4.4487 2.8345 5.3063 1.8967 5.5227 2.1602 4.2259 8.2874 1.1310 4.9854 5.6937 3.6280 4.7877 5.7773 3.5215 4.9853 4.8673 9.9514 2.4892 5.9331 8.2684 1.6303 6.4898 1.0631 1.0791 1.1327 3.8631 11.1293 1.2005 1.5965 1.8905 5.2165 1.2229 1.4435 5.5463 1.1674 4.6220 3.3911 5.3675 3.2431 1.1004 2.4109 2.3300 3.2678 3.5199 1.7484 2.8757 1.4540 1.6275 1.4018 1.2763 1.2406 4.2874 1.0366 1.3358 1.1397 1.0795 4.8533 1.4120 2.6527 1.5285 1.6657 2.4584 3.4294 1.2174 2.5194 1.0869 1.0675 1.0738 1.0731 1.0752 1.0421 1.0849 1.0947 5.1682 8.8795 1.0589 1.0589 1.0592 1.0590 1.0364 1.0590 1.0974 1.1002 1.1031 1.1044 1.0572 1.1048 1.1007 1.0993 1.1084 1.0923 1.0982 1.0826
irintensity: 0.0002 0.0104 0.0490 0.6381 0.7072 0.3673 0.5234 0.1029 0.0636 0.7893 0.2160 0.8901 0.0124 0.0010 0.4333 0.1505 1.6940 1.1931 4.4716 0.8541 3.9488 0.9095 13.7914 36.3160 13.0329 2.3829 78.6419 10.3764 13.9213 1.4662 4.2814 15.1057 59.8365 0.2878 22.1265 4.1835 76.7930 1.4003 11.3576 21.3341 0.1022 1.0656 0.7628 12.7552 1.3491 0.5882 0.5241 0.3060 26.6627 9.5492 0.0235 39.2607 7.0064 26.2841 0.2338 12.7903 0.1861 50.8455 0.2918 28.1590 0.1478 0.2783 105.2525 5.4205 16.9967 6.4731 0.7811 38.2891 55.4824 11.1949 7.6629 9.3319 0.6911 0.0032 1.6600 1.8405 12.5860 1.2997 25.5548 221.2677 88.1345 0.4253 2.4354 3.8168 103.0086 39.3609 53.8811 0.0082 0.0652 0.1367 20.8357 8.8486 104.4096 96.1075 54.3638 16.3954 15.0499 0.7171 111.2105
temp: 298.150 k
press: 1.00000 atm
elementType: 16 7 7 7 7 6 6 6 6 6 6 6 6 6 6 6 6 1 1 1 1 1 1 1 1 1 1 1 1 1 1 1 1 1 1
symmnumber: 1
zpe: 756871.9 jmol-1
zpe.correction: 0.288277 hartree
zpe.thermalcorrener: 0.306011 hartree
zpe.thermalcorrenthalpy: 0.306955 hartree
zpe.thermalcorrgfe: 0.239504 hartree
zpe.sumelectzpe: -1083.840908 hartree
zpe.sumelectthermal: -1083.823175 hartree
zpe.sumelectthermalent: -1083.822230 hartree
zpe.sumelectthermalfe: -1083.889681 hartree
dipole: -2.1477 0.1675 0.0005
dipole: 2.1543
quadrupole: -106.7548 -114.0603 -110.9494
quadrupole: 3.4196 -0.0051 -0.0003
quadrupole: 3.8334 -3.4721 -0.3612 3.4196 -0.0051 -0.0003
hfenergy: -1084.1291856 hartree
pointgroup: C01 [X(C12H18N4S1)]
dipole: 0.8445313 0.0714094 -0.002166 debye
polarizability: 273.2247942|1.4176725|172.386238|-0.4248686|-0.1842429|99.5804426 unknown
InChI: InChI=1S/C12H18N4S/c1-2-3-4-5-6-7-17-12-10-8-15-16-11(10)13-9-14-12/h8-9,16H,2-7H2,1H3
charge 0 multiplicity 1
35 atoms
S  -0.570266 -1.161468 0.005576
N  -1.742963 1.328113 0.002445
N  -5.53053 -0.201228 0.016843
N  -4.144113 1.840956 0.007748
N  -5.346264 -1.588618 0.020005
C  4.77769 -0.58179 -0.00705
C  3.437996 0.189816 -0.005832
C  6.013244 0.34641 -0.009782
C  2.207582 -0.749927 -0.002133
C  7.354139 -0.423199 -0.011004
C  0.89569 0.050447 -0.001061
C  8.583681 0.510839 -0.013374
C  -1.967292 -0.01384 0.006508
C  -3.303178 -0.513806 0.011515
C  -4.335428 0.488076 0.011772
C  -3.997045 -1.770738 0.016709
C  -2.826715 2.176894 0.003321
H  4.819655 -1.245261 0.881823
H  4.81704 -1.247093 -0.894662
H  3.398633 0.854393 0.881787
H  3.395453 0.851716 -0.895307
H  5.975775 1.012397 0.877654
H  5.973186 1.010701 -0.89838
H  2.247401 -1.410161 -0.891144
H  2.250604 -1.407173 0.888953
H  7.391123 -1.088348 -0.897884
H  7.393525 -1.086945 0.876828
H  0.789918 0.687298 0.891295
H  0.78562 0.682826 -0.896071
H  8.585575 1.165113 0.878837
H  8.583277 1.163681 -0.906638
H  9.528842 -0.062461 -0.014139
H  -3.596788 -2.782514 0.018222
H  -6.47457 0.179441 0.01846
H  -2.593994 3.245557 -0.000237
