program: Gaussian 09
title: 000231441
version: EM64L-G09RevD.01
frameworkgroup: C1[X(C11H16N4S)]
method: RPBEPBE
basis: SDD
operation: Freq
keyword: #p
keyword: freq=noraman
keyword: PBEPBE/SDD
title: #p freq=noraman PBEPBE/SDD
converged: NO YES NO NO
title: Mulliken charges:
elementType: S N N N N C C C C C C C C C C C H H H H H H H H H H H H H H H H
charge: 0.229994 -0.383202 -0.006458 -0.015541 0.005577 -0.360690 -0.348038 -0.348674 -0.354973 -0.660516 -0.693855 -0.304996 0.242491 0.107205 -0.400901 -0.366176 0.193448 0.193460 0.189196 0.189154 0.212233 0.212192 0.195720 0.195718 0.283234 0.283199 0.210384 0.210384 0.217326 0.275589 0.347518 0.249996
chargesum: 0.00000
title: Mulliken charges with hydrogens summed into heavy atoms:
elementType: S N N N N C C C C C C C C C C C
charge: 0.229994 -0.035684 -0.006458 -0.015541 0.005577 0.026218 0.030313 0.075751 0.036466 -0.094083 -0.055760 -0.304996 0.242491 0.107205 -0.125313 -0.116180
polarizability: 2.56429433e+02 -8.57206139e-01 1.63178890e+02 -1.01970020e-01 7.21699280e-03 9.10467424e+01
1716.lowfreq: -0.0014 -0.0008 0.0009 5.0406 5.7074 9.9759 17.6895 38.7184 41.3731
frequency: 17.4955 38.7040 41.0390 59.4944 83.4111 108.2842 123.1661 131.5355 137.8587 155.7873 214.3191 219.4831 225.5618 278.3135 288.1356 380.0300 428.7681 444.5785 480.1988 529.3308 571.7261 615.1621 625.3313 650.6684 658.3768 694.6686 726.5321 738.4943 782.2519 788.2388 800.7107 845.3179 870.3878 889.9940 903.7064 929.6820 963.0695 974.2140 1005.9715 1029.7984 1032.5322 1063.9110 1071.4415 1078.6208 1112.6233 1121.1911 1189.6564 1198.9179 1217.5272 1227.7824 1235.6509 1264.7357 1268.3890 1279.5491 1290.4623 1298.6614 1301.0883 1315.8923 1343.9793 1350.3110 1355.9568 1384.5623 1387.6395 1388.8328 1413.7019 1440.4765 1465.1384 1467.0047 1474.2694 1476.2932 1482.2980 1489.0214 1522.5011 1556.6180 2956.4986 2962.0517 2970.5089 2973.2435 2981.5065 2993.8453 3009.8211 3029.3528 3042.3607 3047.3993 3069.9467 3073.1204 3120.0131 3170.3442 3231.5289 3618.2604
redmass: 4.8769 5.1782 1.8867 3.4086 1.8862 4.2094 3.9488 3.0464 1.9217 5.5962 4.3584 8.0749 1.1336 5.6969 4.2913 5.0878 3.6605 4.9521 5.7570 4.8718 10.0594 2.5120 5.8395 8.2645 1.6282 6.3371 1.0640 1.0896 1.1703 3.8287 11.1331 1.5948 1.2184 1.8893 5.2189 1.4431 5.5363 1.1872 3.9259 4.6601 3.9566 2.7713 1.1114 2.2757 3.0207 3.6925 1.6908 2.9086 1.6590 1.4241 1.3460 1.2714 4.2810 1.1486 1.0703 1.0968 5.1305 1.3548 2.6642 1.4785 1.6397 2.4525 3.3799 1.2162 2.5400 1.0869 1.0671 1.0761 1.0700 1.0424 1.0810 1.0916 5.1701 8.8761 1.0589 1.0591 1.0589 1.0367 1.0590 1.0981 1.1015 1.1039 1.0572 1.1047 1.1008 1.0993 1.1085 1.0923 1.0981 1.0826
irintensity: 0.0008 0.0343 0.2917 0.4963 0.8914 0.5303 0.0374 0.3757 0.1963 0.9644 0.7644 0.0130 0.0016 0.1512 1.0783 0.2230 2.3529 5.6080 3.3411 0.9228 13.7030 35.7401 13.5268 2.3259 78.7893 10.4943 13.7360 0.8442 3.7492 14.3701 59.4079 22.4892 0.1615 2.4614 76.3798 11.5838 20.6622 0.9216 0.4516 15.6273 1.5514 1.5609 0.1666 0.5305 30.2452 3.1156 0.4054 39.8990 16.0851 14.8662 0.0707 15.7171 51.2284 0.0235 0.3014 0.3815 124.1456 8.6726 15.4212 6.1485 1.5243 38.8005 54.0407 11.8857 7.9560 9.3309 0.9993 0.2238 1.9142 12.7287 2.4049 22.0775 220.0081 87.7366 1.6193 3.3565 70.8940 36.5058 54.4486 0.0114 0.0004 10.8462 8.8784 74.2985 95.5127 52.8807 16.5253 15.0867 0.7121 110.7691
temp: 298.150 k
press: 1.00000 atm
elementType: 16 7 7 7 7 6 6 6 6 6 6 6 6 6 6 6 1 1 1 1 1 1 1 1 1 1 1 1 1 1 1 1
symmnumber: 1
zpe: 683467.5 jmol-1
zpe.correction: 0.260319 hartree
zpe.thermalcorrener: 0.276697 hartree
zpe.thermalcorrenthalpy: 0.277641 hartree
zpe.thermalcorrgfe: 0.213466 hartree
zpe.sumelectzpe: -1044.617944 hartree
zpe.sumelectthermal: -1044.601566 hartree
zpe.sumelectthermalent: -1044.600622 hartree
zpe.sumelectthermalfe: -1044.664797 hartree
dipole: -2.1123 0.2752 -0.0007
dipole: 2.1301
quadrupole: -97.9350 -107.4871 -104.5594
quadrupole: 2.3095 -0.0100 -0.0031
quadrupole: 5.3922 -4.1600 -1.2322 2.3095 -0.0100 -0.0031
hfenergy: -1044.8782628 hartree
pointgroup: C01 [X(C11H16N4S1)]
dipole: -0.830934 0.1089817 0.0002146 debye
polarizability: 256.4277494|-0.9397268|163.156745|0.175409|1.306418|91.0705712 unknown
InChI: InChI=1S/C11H16N4S/c1-2-3-4-5-6-16-11-9-7-14-15-10(9)12-8-13-11/h7-8,15H,2-6H2,1H3
charge 0 multiplicity 1
32 atoms
S  0.00906 -1.126284 -0.015922
N  4.986696 -0.260531 0.002424
N  1.228863 1.340109 0.030434
N  3.639304 1.807147 0.03964
N  4.776364 -1.643903 -0.022407
C  -3.973384 0.299279 -0.000152
C  -5.326891 -0.447523 -0.015266
C  -2.76018 -0.662563 -0.01281
C  -6.545028 0.50419 -0.004547
C  -1.433674 0.113137 0.004469
C  -7.894285 -0.24653 -0.019428
C  1.42762 -0.005603 0.005817
C  2.753792 -0.530859 -0.002948
C  3.804864 0.451117 0.015077
C  3.423926 -1.800514 -0.025482
C  2.328548 2.168008 0.04607
H  -3.922423 0.947399 0.899051
H  -3.918287 0.975826 -0.87791
H  -5.383891 -1.124165 0.862752
H  -5.37881 -1.097504 -0.913518
H  -2.816256 -1.33563 0.865646
H  -2.810947 -1.305206 -0.914092
H  -6.487154 1.180259 -0.881922
H  -6.492092 1.154045 0.892729
H  -1.311822 0.76223 -0.876957
H  -1.315548 0.728762 0.910068
H  -7.990831 -0.906206 0.863455
H  -7.985912 -0.879667 -0.922048
H  -8.747974 0.45563 -0.011341
H  3.004815 -2.80446 -0.043509
H  5.937754 0.102178 0.009168
H  2.116185 3.240728 0.065458
