program: Gaussian 09
title: 000231438
version: EM64L-G09RevD.01
frameworkgroup: C1[X(C8H10N4S)]
method: RPBEPBE
basis: SDD
operation: Freq
keyword: #p
keyword: freq=noraman
keyword: PBEPBE/SDD
title: #p freq=noraman PBEPBE/SDD
converged: NO YES NO NO
title: Mulliken charges:
elementType: S N N N N C C C C C C C C H H H H H H H H H H
charge: 0.213077 -0.383440 -0.021806 -0.015588 0.005901 -0.317336 0.238938 -0.301079 -0.634258 -0.663141 0.106499 -0.402020 -0.363629 0.297503 0.211114 0.258080 0.218857 0.220643 0.237204 0.221238 0.276091 0.347605 0.249549
chargesum: 0.00000
title: Mulliken charges with hydrogens summed into heavy atoms:
elementType: S N N N N C C C C C C C C
charge: 0.213077 -0.035835 -0.021806 -0.015588 0.005901 -0.019833 0.238938 -0.301079 0.053793 0.015943 0.106499 -0.125930 -0.114081
polarizability: 1.97831149e+02 1.58439809e+00 1.35767632e+02 -1.77990230e+00 -3.63984501e+00 6.97596669e+01
1716.lowfreq: -0.0025 -0.0016 -0.0010 3.6343 5.7930 10.8421 42.6553 51.9922 103.0659
frequency: 42.4967 51.9775 103.0655 125.0166 191.5136 211.0050 218.2175 242.9703 276.9091 285.1337 332.8854 386.1472 437.1087 473.7103 529.3552 562.7691 587.0106 614.8434 625.3605 651.1252 657.9526 787.9007 800.7289 845.3501 883.5439 903.6851 924.7294 928.7024 949.7114 964.2124 1030.0291 1063.4221 1117.6057 1138.9759 1164.5473 1198.8655 1220.0498 1257.5015 1269.2058 1302.2590 1313.2290 1344.2470 1380.5601 1384.8025 1388.0244 1397.4534 1414.4760 1458.5583 1464.9724 1475.4425 1483.9234 1522.6825 1556.8081 2979.4803 2983.6391 3053.7855 3071.2594 3081.0576 3094.6700 3106.2344 3169.9353 3232.3993 3618.9849
redmass: 5.2048 2.8281 4.2310 6.0817 5.3361 1.0476 7.8152 1.1233 5.3677 3.0233 3.1149 3.0057 5.4995 5.7302 4.8708 6.4748 5.1501 2.5516 5.6339 8.2184 1.6300 3.8530 11.0368 1.6026 2.6596 5.0729 1.1627 1.4389 1.4008 5.2423 5.4171 1.4068 4.3495 2.3580 1.9058 2.8306 2.0097 1.3020 4.1130 5.1533 1.4138 2.6814 1.2542 2.2901 3.3947 1.2071 2.5504 1.0488 1.0452 1.0445 1.0461 5.1756 8.8621 1.0372 1.0360 1.0887 1.0983 1.0960 1.0998 1.1001 1.0924 1.0982 1.0826
irintensity: 1.1604 0.0944 1.5019 0.0074 1.8636 0.0869 0.0938 0.1823 0.3822 0.1301 0.4807 0.7870 5.4416 4.3769 1.1173 20.2900 0.6132 34.3327 15.1397 1.2914 78.7285 15.5106 61.4979 21.8707 3.6796 72.9431 5.2004 10.5850 0.7853 21.1645 12.6712 57.9843 7.3842 3.0844 42.7976 34.8398 26.7557 23.4252 46.3631 113.5345 2.8343 15.5701 35.0628 33.8731 45.6309 19.2720 8.7850 7.6349 2.8374 8.4363 16.5830 209.1416 90.5351 22.7460 41.4099 3.1969 2.7176 43.7695 24.6798 19.7554 14.9845 0.7006 108.7941
temp: 298.150 k
press: 1.00000 atm
elementType: 16 7 7 7 7 6 6 6 6 6 6 6 6 1 1 1 1 1 1 1 1 1 1
symmnumber: 1
zpe: 462561.4 jmol-1
zpe.correction: 0.176180 hartree
zpe.thermalcorrener: 0.188291 hartree
zpe.thermalcorrenthalpy: 0.189235 hartree
zpe.thermalcorrgfe: 0.137116 hartree
zpe.sumelectzpe: -926.952580 hartree
zpe.sumelectthermal: -926.940470 hartree
zpe.sumelectthermalent: -926.939526 hartree
zpe.sumelectthermalfe: -926.991645 hartree
dipole: 1.8056 0.3748 -0.0194
dipole: 1.8442
quadrupole: -73.8143 -87.3829 -85.5007
quadrupole: -1.8883 -0.2632 0.2913
quadrupole: 8.4183 -5.1503 -3.2681 -1.8883 -0.2632 0.2913
hfenergy: -927.1287606 hartree
pointgroup: C01 [X(C8H10N4S1)]
dipole: -0.700734 0.1337123 -0.1324844 debye
dipolederiv: -0.9553653 -0.1547631 -0.0831101 -0.3425659 -0.1645196 0.0242612 0.0493047 0.0198068 -0.1539215 -0.4479552 0.1784625 -0.0759946 -0.1603157 -0.3399282 0.0133191 0.0342766 0.0427288 -0.264321 -0.728024 -0.1591069 -0.0120996 -0.7342388 -0.9074292 0.1532211 0.1811805 0.2237878 -0.2028558 -0.7477336 0.0073814 -0.0590278 -0.0157701 -0.4897131 0.0830851 -0.0338731 0.0927096 -0.2287013 -0.2983013 0.1975835 -0.0743677 0.4698738 0.0297285 -0.0288945 -0.1546863 -0.0555536 -0.1992485 0.7392686 -0.1138567 0.1314182 -0.3997979 0.0658991 -0.0754918 0.16727 -0.042309 0.2575508 -0.9141553 -0.0888053 -0.0674838 -0.2373344 -0.1642709 0.052667 -0.0204857 0.0634846 0.0477426 1.4571842 0.3119005 0.0692604 0.9446733 0.6502299 -0.0973124 -0.1656212 -0.168696 0.0436346 -0.156551 -0.0189723 -0.010738 0.1028497 0.0626252 0.0647466 0.0386253 0.0268586 -0.126317 -0.1440163 -0.0318273 0.0478909 0.1321975 0.0776228 0.0309213 -0.0453386 0.0357287 -0.0237 0.7318188 -0.2879885 0.147361 0.1061811 0.2777734 -0.0358365 0.015716 -0.0774516 0.143481 0.0518988 -0.0802752 0.0397738 -0.1359834 0.2075476 -0.1073574 0.0576367 -0.0994469 -0.0520106 0.8461638 0.1643698 0.032452 0.2514779 0.5653853 -0.1548885 -0.0078313 -0.1750212 0.0097117 0.0167384 -0.0208606 -0.0265549 0.0510452 -0.0380715 -0.034441 -0.053698 -0.0182349 -0.0010864 -0.0855038 0.1188974 -0.0795393 0.1495805 0.0149991 0.0444585 -0.1225753 0.0256216 0.0308268 -0.0179091 -0.0554826 0.1176549 -0.0579143 0.0697772 0.035968 0.1115729 0.0175167 0.0558686 0.1005974 -0.033292 -0.033221 -0.0820735 -0.0983309 -0.1056887 0.0008349 -0.0218735 0.0483498 -0.1409314 0.0799824 -0.028252 0.1102163 0.0169738 0.0417305 -0.0454987 0.0510693 0.0919526 0.1224279 -0.001614 -0.0309344 -0.0300617 0.0938945 0.0045635 0.015412 -0.0035875 -0.1472844 0.0930913 -0.0100702 0.0077704 -0.1070519 -0.1044299 -0.0527739 -0.0088986 -0.0868255 0.0667239 0.0865808 -0.0419877 0.0071786 -0.0246994 0.0382152 0.0383207 -0.00046 0.0386013 0.1603283 0.3180435 0.0127574 -0.0060279 0.0154906 0.1936408 0.0514958 -0.0078914 0.0513006 0.3374792 0.0726329 0.0275675 -0.0134091 -0.0057792 -0.057619 0.0539263 -0.0049714 0.0597854 0.1057966 unknown
polarizability: 196.4201521|0.8177724|128.4820414|13.136774|-21.0225592|78.4562541 unknown
InChI: InChI=1S/C8H10N4S/c1-5(2)13-8-6-3-11-12-7(6)9-4-10-8/h3-5,12H,1-2H3
charge 0 multiplicity 1
23 atoms
S  -1.650803 -1.202542 0.209223
N  3.330012 -0.397387 0.364355
N  -0.362442 1.15053 -0.433638
N  2.0520 1.585819 -0.361073
N  3.077693 -1.718215 0.753418
C  -3.086469 -0.035271 -0.331474
C  1.097468 -0.642999 0.250183
C  -0.208207 -0.135947 -0.018495
C  -3.197544 -0.013402 -1.863305
C  -4.356288 -0.534806 0.376446
C  2.175049 0.289249 0.052274
C  1.725713 -1.859778 0.681793
C  0.757237 1.937046 -0.581392
H  -2.773161 0.955161 0.039361
H  -4.017199 0.668279 -2.16297
H  -2.263846 0.353967 -2.319541
H  -3.421685 -1.01824 -2.263367
H  -5.202811 0.124248 0.107592
H  -4.243409 -0.521638 1.474054
H  -4.618734 -1.561953 0.063597
H  1.276482 -2.816371 0.940351
H  4.288783 -0.05652 0.340827
H  0.57826 2.963271 -0.91472
