program: Gaussian 09
title: 000231437
version: EM64L-G09RevD.01
frameworkgroup: C1[X(C8H10N4S)]
method: RPBEPBE
basis: SDD
operation: Freq
keyword: #p
keyword: freq=noraman
keyword: PBEPBE/SDD
title: #p freq=noraman PBEPBE/SDD
converged: NO YES NO NO
title: Mulliken charges:
elementType: S N N N N C C C C C C C C H H H H H H H H H H
charge: 0.228416 -0.383205 -0.007397 -0.015203 0.005985 -0.599808 -0.348636 0.242724 -0.306687 0.107957 -0.671159 -0.400623 -0.365189 0.276805 0.276763 0.216332 0.216318 0.214416 0.224443 0.214421 0.275641 0.347691 0.249996
chargesum: 0.00000
title: Mulliken charges with hydrogens summed into heavy atoms:
elementType: S N N N N C C C C C C C C
charge: 0.228416 -0.035514 -0.007397 -0.015203 0.005985 -0.046240 0.084014 0.242724 -0.306687 0.107957 -0.017880 -0.124982 -0.115193
polarizability: 2.01623528e+02 -1.45841080e+00 1.36454086e+02 -2.57315367e-02 -5.36811849e-03 6.51847226e+01
1716.lowfreq: -0.0018 0.0011 0.0013 2.5745 5.3298 5.5348 23.2842 46.7940 74.3177
frequency: 22.3381 46.7549 74.3173 110.9272 126.5991 186.2478 219.5489 222.9049 237.8641 278.3926 340.3386 422.5924 476.8976 529.4985 570.5048 615.2837 625.5028 650.6508 658.4576 693.1926 742.5833 788.2848 800.5984 845.2918 856.2984 902.1796 904.4572 929.6974 963.8273 1030.8056 1045.5365 1057.0410 1102.9999 1121.2101 1199.0202 1212.3810 1219.8102 1250.0625 1268.5864 1284.8995 1301.3918 1336.9590 1344.2528 1384.7613 1387.6722 1394.1143 1413.9306 1441.4864 1475.7695 1478.6817 1486.1943 1522.6715 1556.8880 2981.7676 2991.4355 3040.1848 3043.5375 3080.4324 3083.1350 3122.0914 3170.6661 3231.5955 3618.3004
redmass: 2.8289 2.2246 4.6360 2.7773 6.0684 5.6155 8.1925 1.1113 3.9712 5.6882 3.9000 13.2909 5.9644 4.8714 10.1971 2.5395 5.7827 8.2548 1.6210 5.4779 1.0838 3.8584 11.0537 1.5938 1.1864 2.4405 3.2633 1.4431 5.4121 5.3838 2.9014 1.1703 2.4393 3.9746 2.9165 1.4131 1.9296 1.2580 4.2707 1.1005 5.2479 1.4576 2.6359 2.4584 3.3661 1.2044 2.5481 1.0868 1.0504 1.0410 1.0833 5.1677 8.8883 1.0354 1.0601 1.1020 1.0574 1.1014 1.0994 1.1084 1.0923 1.0982 1.0826
irintensity: 0.0841 0.7482 0.5536 1.3214 0.2010 0.9063 0.0108 0.0018 1.8500 0.1650 0.6197 5.1765 2.2928 0.9684 11.0416 35.1306 13.9125 1.8235 79.4471 7.5961 9.7156 15.2145 58.7584 22.9958 0.2129 65.0080 27.1363 11.6326 15.2390 11.8553 3.0893 1.4951 18.2593 11.7765 37.3344 0.0061 28.7961 9.4469 49.0925 0.0578 113.5693 5.3526 18.0211 36.6077 51.2600 15.1117 7.2899 8.7415 4.4754 13.9803 13.2593 208.0380 87.5658 36.3478 19.4213 5.1911 8.1512 47.7012 43.8872 20.7972 14.9470 0.6909 108.5089
temp: 298.150 k
press: 1.00000 atm
elementType: 16 7 7 7 7 6 6 6 6 6 6 6 6 1 1 1 1 1 1 1 1 1 1
symmnumber: 1
zpe: 463686.4 jmol-1
zpe.correction: 0.176609 hartree
zpe.thermalcorrener: 0.188814 hartree
zpe.thermalcorrenthalpy: 0.189758 hartree
zpe.thermalcorrgfe: 0.136153 hartree
zpe.sumelectzpe: -926.948760 hartree
zpe.sumelectthermal: -926.936555 hartree
zpe.sumelectthermalent: -926.935611 hartree
zpe.sumelectthermalfe: -926.989216 hartree
dipole: -1.9093 0.2295 -0.0001
dipole: 1.9231
quadrupole: -73.2927 -87.6429 -85.4257
quadrupole: 2.4744 -0.0024 -0.0001
quadrupole: 8.8278 -5.5225 -3.3052 2.4744 -0.0024 -0.0001
hfenergy: -927.1253691 hartree
pointgroup: C01 [X(C8H10N4S1)]
dipole: -0.7524282 0.0792525 -0.0000353 debye
dipolederiv: -0.8516021 -0.1919354 0.0001718 -0.4703478 -0.170132 0.0000978 0.0001384 0.0000598 -0.093632 -0.4465032 0.1867967 0.0000231 -0.1751994 -0.3494229 0.0000079 0.0001056 -0.0000165 -0.2528752 -0.6706333 -0.1287498 0.0001465 -0.7398488 -1.0033333 0.000231 0.0001936 0.0001157 -0.1449021 -0.7410333 0.0160996 0.0001243 -0.0205366 -0.5175844 0.0000278 0.0000915 0.0000424 -0.1976734 -0.327521 0.1954438 0.0000395 0.4809803 0.06546 -0.0001426 -0.0000407 -0.0000945 -0.2026145 0.5433147 -0.104015 -0.0000856 -0.2587241 0.0494637 0.0000819 -0.0000338 0.0000779 0.1429086 -0.0140272 -0.000702 -0.0000136 0.2660154 0.0773762 -0.0000701 0.0001171 -0.0000592 0.1559349 -0.9021281 -0.1023091 0.0002086 -0.2663868 -0.1982097 0.0000849 0.0002728 0.000054 0.0702178 1.374101 0.3293397 -0.0003638 0.997092 0.753645 -0.0002492 -0.0004528 -0.0001595 0.0116596 0.7362594 -0.2986148 -0.0001324 0.1240809 0.290625 -0.0000272 -0.0001363 0.0000497 0.1170073 -0.1098638 0.0421016 0.0000065 -0.09755 0.0528297 -0.0000103 -0.0001116 -0.0000138 0.0988935 0.0629254 -0.0964513 -0.0000126 -0.1511515 0.2320244 0.0000263 -0.000036 -0.0000161 -0.0904765 0.8155049 0.1559909 -0.0002202 0.2399226 0.6315822 -0.0001226 -0.0002099 -0.000132 -0.0426967 -0.0290973 0.0099888 0.0033792 0.0618795 -0.0055922 0.0778415 0.0312002 0.0689375 -0.0214315 -0.0292104 0.0100152 -0.0033072 0.0619342 -0.005551 -0.0778949 -0.031172 -0.0689836 -0.0215852 0.0612273 0.0291901 0.0138337 -0.0233212 -0.0184222 -0.1103874 -0.0137063 -0.123919 -0.0653218 0.0612295 0.0291927 -0.0137904 -0.0233741 -0.0186739 0.110435 0.013704 0.1239778 -0.065072 0.0985952 -0.0079288 0.0320078 0.0454701 -0.0091391 0.1162232 -0.0133356 0.1278852 -0.0797005 -0.204051 -0.0831497 -0.0001062 -0.1021543 0.0241754 -0.0000946 -0.0001301 -0.0000846 0.1074603 0.0985687 -0.0078103 -0.0319342 0.0455234 -0.0087964 -0.1161121 0.0135003 -0.1277979 -0.0800702 0.088194 -0.0390795 0.0000177 -0.0206214 0.022716 0.0000143 0.0000274 0.0000345 0.1732881 0.3154444 0.0208801 0.0000006 0.0240428 0.179258 0.0000193 -0.0000061 0.0000215 0.3548269 0.0703064 0.0357066 0.0000067 0.0022748 -0.0742982 0.0000199 0.0000202 0.0000206 0.1258548 unknown
polarizability: 201.6522994|-0.5011428|136.4253145|-0.02565|-0.0057453|65.1847226 unknown
InChI: InChI=1S/C8H10N4S/c1-2-3-13-8-6-4-11-12-7(6)9-5-10-8/h4-5,12H,2-3H2,1H3
charge 0 multiplicity 1
23 atoms
S  -1.512892 -1.170772 0.00066
N  3.449603 -0.223194 -0.000602
N  -0.333989 1.315762 0.000144
N  2.068357 1.82258 -0.000495
N  3.262132 -1.61003 -0.000336
C  -2.975209 0.045541 0.000781
C  -4.28933 -0.752957 0.000217
C  1.221591 -0.53004 -0.000054
C  -0.112878 -0.026517 0.000245
C  2.256323 0.469267 -0.000405
C  -5.508403 0.198401 0.000597
C  1.91253 -1.788698 -0.000195
C  0.751977 2.161963 -0.000208
H  -2.86766 0.680465 -0.892759
H  -2.868085 0.679857 0.894809
H  -4.329989 -1.410052 -0.889772
H  -4.330229 -1.41101 0.88949
H  -5.506784 0.850017 -0.892587
H  -6.452296 -0.375464 -0.000067
H  -5.507239 0.848719 0.894725
H  1.509825 -2.799489 -0.000048
H  4.394611 0.155055 -0.000844
H  0.521933 3.231196 -0.000294
