program: Gaussian 09
title: 000231436
version: EM64L-G09RevD.01
frameworkgroup: C1[X(C7H8N4S)]
method: RPBEPBE
basis: SDD
operation: Freq
keyword: #pfreq=noraman
keyword: PBEPBE/SDD
title: #p freq=noraman PBEPBE/SDD
converged: NO YES NO YES
title: Mulliken charges:
elementType: S N N N N C C C C C C C H H H H H H H H
charge: 0.228842 -0.383070 -0.014987 0.006397 -0.009633 0.247344 0.109018 -0.314112 -0.400289 -0.568308 -0.662476 -0.364198 0.275724 0.281357 0.281359 0.347912 0.230350 0.230352 0.228341 0.250077
chargesum: 0.00000
title: Mulliken charges with hydrogens summed into heavy atoms:
elementType: S N N N N C C C C C C C
charge: 0.228842 -0.035158 -0.014987 0.006397 -0.009633 0.247344 0.109018 -0.314112 -0.124565 -0.005592 0.026567 -0.114122
polarizability: 1.81720920e+02 -2.07389616e+00 1.27798184e+02 4.90715803e-03 -7.77488796e-03 5.62471374e+01
1716.lowfreq: -5.6262 -0.0016 0.0018 0.0025 3.5344 4.6002 31.1380 63.7553 104.2231
frequency: 30.8015 63.7416 104.2228 125.3395 217.1618 218.4721 239.9268 278.1466 279.9733 426.0141 473.8749 529.7422 570.4324 615.4162 622.4424 625.7078 651.4804 658.5552 773.2425 788.3892 800.7768 845.0667 903.6918 929.6958 963.6069 994.2126 1031.0179 1045.6150 1067.3809 1119.4685 1198.9252 1220.4123 1231.1730 1268.3640 1278.3934 1301.6227 1343.9998 1384.8180 1388.0509 1399.1120 1414.1684 1446.3639 1472.1936 1483.0412 1522.6704 1557.0247 2989.1370 3052.1402 3084.4368 3087.3974 3132.0992 3170.8069 3231.3049 3618.5909
redmass: 2.8660 2.5371 4.2126 6.4213 6.4370 6.3550 1.1466 5.6964 3.6928 9.6275 6.2148 4.8785 10.2177 2.6074 4.8360 5.5887 8.1963 1.6087 1.1192 3.7638 11.1510 1.6115 5.2060 1.4420 5.5157 1.7950 5.3464 1.2157 2.3022 4.8971 2.8773 2.0301 1.2277 4.1909 1.2814 5.3409 2.6715 2.4512 3.2933 1.2073 2.5838 1.0847 1.0392 1.0482 5.1622 8.8920 1.0356 1.0598 1.0972 1.1013 1.1081 1.0924 1.0982 1.0826
irintensity: 0.1455 2.4581 1.2886 0.0212 1.5762 0.0241 0.0413 0.1818 0.6282 5.2782 2.8249 1.0420 11.9334 33.4455 1.7904 15.1426 0.8444 80.2380 9.9614 14.4964 56.3236 22.8610 70.6144 11.5270 17.7139 24.6728 11.6453 0.3956 7.1557 10.2353 37.2627 29.4326 0.5512 47.7832 34.5505 100.2925 17.4336 39.4472 47.9553 18.1889 8.2297 10.5501 15.8076 9.3284 199.8110 88.3172 31.8253 3.5634 23.2660 15.2882 19.7294 15.0332 0.6782 107.3824
temp: 298.150 k
press: 1.00000 atm
elementType: 16 7 7 7 7 6 6 6 6 6 6 6 1 1 1 1 1 1 1 1
symmnumber: 1
zpe: 390400.5 jmol-1
zpe.correction: 0.148696 hartree
zpe.thermalcorrener: 0.159462 hartree
zpe.thermalcorrenthalpy: 0.160407 hartree
zpe.thermalcorrgfe: 0.110715 hartree
zpe.sumelectzpe: -887.725824 hartree
zpe.sumelectthermal: -887.715058 hartree
zpe.sumelectthermalent: -887.714114 hartree
zpe.sumelectthermalfe: -887.763806 hartree
dipole: -1.7208 0.3320 0.0012
dipole: 1.7525
quadrupole: -66.1270 -81.2027 -79.0811
quadrupole: 1.2792 0.0031 0.0017
quadrupole: 9.3432 -5.7324 -3.6109 1.2792 0.0031 0.0017
hfenergy: -887.8745202 hartree
pointgroup: C01 [X(C7H8N4S1)]
dipole: -0.6822242 0.0998326 0.0004659 debye
dipolederiv: -0.8458023 -0.1876533 0.0000033 -0.4292822 -0.1657995 -0.0000083 -0.0000044 0.0000176 -0.092787 -0.439235 0.1876114 -0.000027 -0.1725857 -0.3511182 -0.0000128 -0.0003044 0.000065 -0.2531353 -0.7264291 0.0204362 0.0001191 -0.0081601 -0.5206664 0.000054 -0.0001182 -0.0001465 -0.1974049 -0.3026244 0.2025762 -0.0000233 0.4844985 0.050397 0.00021 0.0000999 0.0001082 -0.2026788 -0.6824522 -0.1373482 -0.0001025 -0.7156423 -0.996013 -0.0000004 0.0002202 0. -0.1479051 -0.8892736 -0.0912966 -0.000017 -0.2394794 -0.1936592 -0.0000217 -0.0000593 0.000058 0.0735897 0.7233646 -0.3082792 0.0001281 0.1066285 0.298076 -0.0001552 0.0001786 -0.000172 0.1169136 1.3841888 0.3218306 -0.0000125 0.9331644 0.7414802 -0.0000761 0.0000165 -0.0000663 0.008108 0.0527848 -0.0905097 -0.0000744 -0.1401797 0.2367687 -0.0000349 0.000044 -0.0000505 -0.0909815 0.5745764 -0.1084686 0.0000031 -0.2630684 0.0702877 0.0000026 0.0000361 0.0000045 0.1362114 -0.1565705 -0.0558643 0.0000183 0.1429512 0.0488 0.0000018 -0.0000025 0.0000078 0.0705408 0.8111862 0.1520622 -0.0000249 0.219996 0.6268042 0.0000788 -0.0002587 0.0006608 -0.0422549 0.0850586 -0.0395389 0.0000047 -0.0212118 0.023891 -0.0000034 -0.0000067 -0.0000124 0.1739285 -0.0347938 -0.0061959 -0.0234689 0.0647371 -0.0043208 -0.0819679 -0.031349 -0.0717342 -0.0177094 -0.0347885 -0.0061834 0.0234635 0.0647468 -0.0042905 0.0819663 0.031334 0.0717359 -0.0177508 0.3150843 0.0179054 0.0000161 0.0200616 0.1786377 -0.0000201 0.0000612 -0.0000246 0.355288 0.1166231 0.0060509 0.0102531 -0.0762781 0.0166551 -0.1104342 -0.0388577 -0.1116739 -0.0611484 0.116626 0.0060609 -0.0102709 -0.0762548 0.0167075 0.1104223 0.0388557 0.1116546 -0.0612028 -0.1391106 0.0855636 0.0000012 0.1048668 0.0029932 0.0000087 0.0000018 0.0000081 0.1240258 0.0715872 0.0312409 0.0000108 0.0004917 -0.0756309 -0.0000094 0.000113 -0.0004401 0.126353 unknown
polarizability: 181.7980067|0.3719677|127.7210967|0.0052539|-0.0075449|56.2471374 unknown
InChI: InChI=1S/C7H8N4S/c1-2-12-7-5-3-10-11-6(5)8-4-9-7/h3-4,11H,2H2,1H3
charge 0 multiplicity 1
20 atoms
S  -2.007938 -1.103542 -0.000001
N  2.977167 -0.27831 0.000356
N  1.646147 1.800279 -0.000049
N  2.756307 -1.659994 -0.000082
N  -0.767662 1.352197 -0.000249
C  0.742332 -0.531099 -0.000049
C  1.801049 0.442821 0.000029
C  -0.579336 0.005001 -0.000087
C  1.402823 -1.806163 0.000088
C  -3.438485 0.151782 -0.00006
C  -4.765196 -0.618635 0.000111
C  0.338659 2.171872 -0.00066
H  0.975987 -2.806988 0.000112
H  -3.310924 0.78247 0.89272
H  -3.311034 0.78226 -0.893005
H  3.93104 0.076991 0.000579
H  -4.86746 -1.256725 -0.895268
H  -4.867352 -1.256515 0.895651
H  -5.603081 0.102233 0.000078
H  0.134657 3.246365 0.000286
