program: Gaussian 09
title: 000231540
version: EM64L-G09RevD.01
frameworkgroup: C1[X(C32H25Cl)]
method: RPBEPBE
basis: SDD
operation: Freq
keyword: #p
keyword: freq=noraman
keyword: PBEPBE/SDD
title: #p freq=noraman PBEPBE/SDD
converged: YES YES NO NO
title: Mulliken charges:
elementType: Cl C C C C C C C C C C C C C C C C C C C C C C C C C C C C C C C C H H H H H H H H H H H H H H H H H H H H H H H H H
charge: -0.062360 0.042115 -0.456532 0.425289 0.330859 0.313775 0.449718 0.431716 -0.401264 -0.358276 -0.404052 -0.347317 -0.407063 -0.382540 -0.437967 -0.429874 -0.372318 -0.362306 -0.238075 -0.255617 -0.265109 -0.265044 -0.268521 -0.271163 -0.237647 -0.245605 -0.263972 -0.252371 -0.121510 -0.254677 -0.247922 -0.247630 -0.247030 0.223985 0.274195 0.253503 0.275709 0.257408 0.299575 0.262371 0.237053 0.256037 0.270136 0.266142 0.252794 0.253517 0.228582 0.227818 0.231389 0.225865 0.224872 0.226536 0.225769 0.224473 0.230009 0.228100 0.227265 0.227185
chargesum: 0.00000
title: Mulliken charges with hydrogens summed into heavy atoms:
elementType: Cl C C C C C C C C C C C C C C C C C C C C C C C C C C C C C C C C
charge: -0.062360 0.042115 -0.232548 0.425289 0.330859 0.313775 0.449718 0.431716 -0.127069 -0.104773 -0.128343 -0.089909 -0.107488 -0.120169 -0.200914 -0.173836 -0.102182 -0.096164 0.014719 -0.002101 -0.036527 -0.037226 -0.037133 -0.045297 -0.012775 -0.019069 -0.038203 -0.027898 -0.121510 -0.024668 -0.019822 -0.020365 -0.019845
polarizability: 3.79160393e+02 -2.71491471e+01 3.33617203e+02 -1.11550322e+01 -1.57333646e+01 3.10671825e+02
1716.lowfreq: -7.9691 0.0011 0.0015 0.0017 1.2190 5.4457 16.3155 28.7603 41.9671
frequency: 15.7333 28.7373 41.9215 46.3620 52.1154 57.6244 63.1971 69.2465 73.4193 83.7946 93.1840 122.9317 137.2901 162.5715 167.8465 204.6906 220.5943 237.1898 248.1279 250.5000 268.8558 273.1401 282.4410 295.7511 331.6168 347.9086 402.1013 403.6759 404.6187 407.4673 417.6631 429.7292 471.9723 486.1026 505.6215 511.6409 531.4915 585.3050 604.9684 614.8187 616.3208 617.6745 620.0330 624.8560 629.8788 649.5946 685.7457 701.6821 704.6773 706.7488 708.7058 719.4398 723.7190 751.2140 760.2803 764.2166 786.6756 806.6179 824.9502 827.8653 838.1827 852.3445 855.0292 857.9895 870.1495 896.3189 909.0771 921.6993 932.7345 936.9131 948.6111 953.6061 968.1317 972.4680 978.0993 981.8847 983.1414 991.0629 991.1611 991.7748 992.4523 995.2198 996.1647 996.9237 997.7905 1000.4989 1007.7381 1029.0324 1030.8639 1032.6747 1033.8331 1078.3266 1084.1447 1087.7959 1088.8126 1093.4220 1120.4162 1137.8017 1157.2339 1170.6719 1171.7190 1173.6505 1174.0697 1175.0957 1176.9048 1194.5173 1196.5836 1197.9832 1199.6498 1205.1981 1206.8872 1251.7946 1298.8321 1302.4584 1324.3846 1330.7162 1334.4459 1350.4813 1357.5943 1369.5547 1374.8558 1378.0241 1387.5578 1391.1023 1430.9453 1435.2802 1436.9067 1441.7895 1474.6335 1480.8068 1482.6668 1483.9263 1484.1729 1578.5566 1583.1656 1587.4965 1588.0077 1589.9727 1591.5789 1606.8611 1607.2243 1609.7836 1611.2127 3000.1044 3107.3673 3121.3736 3121.8863 3123.0933 3124.9397 3129.3148 3129.7677 3131.9024 3133.3971 3138.2750 3142.6128 3146.6581 3150.8809 3153.9008 3155.7774 3158.3194 3159.4540 3161.6901 3165.4753 3165.7747 3171.2326 3175.4105 3180.1827 3181.6508
redmass: 5.7743 6.4584 4.0735 4.7223 5.2444 4.6053 4.8813 4.4856 5.2200 4.3619 4.4063 4.0614 5.7508 6.7721 5.4241 7.0454 6.5236 4.7285 4.4327 4.9813 4.7685 5.2225 4.5277 4.9960 5.5829 4.4984 2.8328 2.8388 2.8339 2.9718 5.7271 3.4400 3.7538 3.6856 3.7306 3.6123 3.5221 5.7277 5.3687 5.6884 6.3365 6.2382 6.2443 5.3008 6.8780 5.8550 5.7205 2.6231 2.1457 1.8078 1.8643 2.6664 1.7150 2.2199 2.1873 1.9729 2.4942 2.1028 2.2200 1.9622 1.9577 1.2501 1.2618 1.2545 1.2518 2.6036 1.9102 1.8217 1.5300 1.9281 1.8580 1.5076 3.1119 1.4876 1.4013 1.3944 1.4140 5.2539 5.3163 5.4775 4.5331 1.4844 1.4270 1.5292 2.4569 1.3759 1.2879 2.3632 2.2361 2.3527 2.2299 2.9465 1.6552 1.6764 1.6379 1.6449 1.3972 3.2483 3.3744 1.2381 1.0726 1.1289 1.0779 2.5475 1.9622 1.5036 1.2013 1.1429 1.2714 1.1473 1.3165 1.5083 1.4195 1.3367 1.4934 1.3647 1.2752 1.4824 3.6390 5.6956 6.5652 6.1883 4.0515 3.5114 2.2511 2.2650 2.2119 2.0695 2.1807 2.1405 2.1451 2.1643 2.1119 6.7411 6.0903 5.9405 5.9418 5.7290 6.1558 5.8827 5.9580 5.9342 6.0206 1.0814 1.0876 1.0846 1.0845 1.0848 1.0865 1.0884 1.0884 1.0884 1.0894 1.0932 1.0941 1.0926 1.0935 1.0885 1.0949 1.0991 1.0993 1.0962 1.0998 1.0958 1.0968 1.0959 1.0942 1.0933
irintensity: 0.0409 0.0583 0.0176 0.0256 0.0567 0.0858 0.0560 0.0139 0.3042 0.0727 0.2132 0.0445 0.0390 0.2563 0.7002 0.2196 0.0120 0.7781 0.1282 0.2820 0.1588 0.3976 0.5528 0.3441 0.5132 0.8591 0.1032 0.1884 0.0372 0.0854 7.3150 3.3020 6.3448 8.2925 13.1718 2.6822 15.7001 11.9102 4.0956 9.0343 0.8234 1.4332 2.8157 25.8938 0.8136 1.0097 8.0070 27.0395 36.5894 48.9114 39.0322 49.2332 60.1022 55.9506 47.1978 4.2153 34.9885 6.4608 2.8335 0.4137 31.2495 0.5257 0.7482 0.0102 1.1529 4.3110 0.0693 2.9748 1.6430 0.9887 2.4040 0.4673 0.6662 0.2760 0.6213 0.5635 0.1616 0.3144 2.1004 0.8458 2.1747 4.0072 1.9424 10.6637 33.9595 1.7526 0.4534 9.3219 9.0204 6.4585 10.4374 40.7353 0.7768 1.6985 14.7535 2.8605 4.2844 1.6409 1.2215 0.1859 0.3246 0.0687 0.8057 2.0697 0.7631 1.1551 0.8656 1.1074 4.0563 0.4852 4.0199 0.8231 3.0049 2.3412 0.1994 0.1799 2.0483 4.8530 2.3509 2.4675 2.0615 1.9675 1.0571 3.5412 5.4488 6.8904 13.0898 4.3151 95.2646 14.0229 21.2266 25.0832 35.5143 3.3000 0.7167 0.8270 3.1191 0.1920 6.9475 4.3491 10.1824 5.8836 7.7624 15.9569 8.2372 2.3149 0.3405 0.1348 0.8743 9.2920 2.3832 7.7084 9.7241 26.3720 33.2412 25.1660 27.9354 2.5379 25.9222 34.0417 29.0629 25.0022 16.1174 3.9176 1.5821 8.0853 8.0084 5.7083
temp: 298.150 k
press: 1.00000 atm
elementType: 17 6 6 6 6 6 6 6 6 6 6 6 6 6 6 6 6 6 6 6 6 6 6 6 6 6 6 6 6 6 6 6 6 1 1 1 1 1 1 1 1 1 1 1 1 1 1 1 1 1 1 1 1 1 1 1 1 1
symmnumber: 1
zpe: 1214846.9 jmol-1
zpe.correction: 0.462711 hartree
zpe.thermalcorrener: 0.489857 hartree
zpe.thermalcorrenthalpy: 0.490801 hartree
zpe.thermalcorrgfe: 0.403751 hartree
zpe.sumelectzpe: -1692.198414 hartree
zpe.sumelectthermal: -1692.171268 hartree
zpe.sumelectthermalent: -1692.170324 hartree
zpe.sumelectthermalfe: -1692.257374 hartree
dipole: -2.2971 0.2263 0.4786
dipole: 2.3573
quadrupole: -206.6785 -189.5447 -183.5865
quadrupole: -2.4170 0.4999 -3.8678
quadrupole: -13.4086 3.7251 9.6834 -2.4170 0.4999 -3.8678
hfenergy: -1692.661125 hartree
pointgroup: C01 [X(C32H25Cl1)]
dipole: -0.8901577 -0.0653047 -0.2519631 debye
polarizability: 380.6048146|27.0507222|325.5698899|11.7212577|-16.4444711|317.2747166 unknown
InChI: InChI=1S/C32H25Cl/c33-30-23-21-29(22-24-30)32(27-17-9-3-10-18-27,28-19-11-4-12-20-28)31(25-13-5-1-6-14-25)26-15-7-2-8-16-26/h1-24,31H
charge 0 multiplicity 1
58 atoms
Cl 6.271626 -0.029786 1.291958
C  0.207016 -0.532762 -0.08162
C  -0.597876 0.562711 0.800438
C  1.741009 -0.339317 0.210506
C  -0.120781 -0.390511 -1.595781
C  -0.053215 -1.991004 0.423318
C  -2.127726 0.417483 0.92284
C  -0.256712 2.035141 0.466509
C  2.725298 -0.165369 -0.791943
C  2.1967 -0.466438 1.553136
C  -0.850373 -1.384829 -2.301952
C  0.676415 -3.045685 -0.19621
C  0.268764 0.768999 -2.323411
C  -0.88645 -2.328672 1.517116
C  -2.702032 0.759745 2.178388
C  0.884327 2.65325 1.04395
C  -3.007161 0.054867 -0.127994
C  -1.093621 2.827724 -0.36266
C  4.101892 -0.070573 -0.475876
C  3.559638 -0.369949 1.894108
C  -1.17632 -1.233638 -3.668139
C  0.562733 -4.379146 0.240932
C  -0.058708 0.926754 -3.687881
C  -1.0000 -3.667177 1.965334
C  -4.096598 0.726848 2.387431
C  1.197173 4.005296 0.778453
C  -4.406033 0.014772 0.077924
C  -0.785115 4.179253 -0.63071
C  4.500419 -0.160135 0.86688
C  -0.782931 -0.074202 -4.372804
C  -0.281686 -4.701213 1.330571
C  -4.960344 0.347287 1.333299
C  0.365482 4.775764 -0.065557
H  -0.20926 0.402459 1.824862
H  2.436845 -0.113866 -1.84452
H  1.482868 -0.682916 2.355531
H  -1.176479 -2.289252 -1.780424
H  1.353096 -2.813671 -1.026528
H  0.829483 1.564184 -1.826757
H  -1.473193 -1.563076 2.027869
H  -2.042043 1.065634 3.000848
H  1.538951 2.073799 1.70248
H  -2.61258 -0.196704 -1.114163
H  -1.996524 2.388309 -0.796793
H  4.843378 0.066636 -1.268503
H  3.884306 -0.472192 2.933631
H  -1.740282 -2.023541 -4.177244
H  1.139018 -5.164661 -0.260919
H  0.256092 1.836229 -4.212014
H  -1.65708 -3.894083 2.812718
H  -4.507809 0.996396 3.366972
H  2.085233 4.455801 1.23622
H  -5.062275 -0.275327 -0.750853
H  -1.448229 4.767444 -1.275401
H  -1.034239 0.046135 -5.432548
H  -0.370848 -5.736367 1.678558
H  -6.044595 0.31579 1.488428
H  0.602859 5.826148 -0.2689
