program: Gaussian 09
title: 000231435
version: EM64L-G09RevD.01
frameworkgroup: C1[X(C11H13N5)]
method: RPBEPBE
basis: SDD
operation: Freq
keyword: #pfreq=noraman
keyword: PBEPBE/SDD
title: #p freq=noraman PBEPBE/SDD
converged: YES YES NO NO
title: Mulliken charges:
elementType: N N N N N C C C C C C C C C C C H H H H H H H H H H H H H
charge: -0.122422 -0.113753 -0.384763 -0.032255 -0.017554 0.247616 0.028173 -0.490563 -0.447426 0.088476 -0.391489 -0.019187 -0.028336 -0.376799 -0.576208 -0.582694 0.242488 0.246770 0.220560 0.276574 0.270880 0.343508 0.248319 0.245053 0.244483 0.224090 0.218834 0.220919 0.216705
chargesum: 0.00000
title: Mulliken charges with hydrogens summed into heavy atoms:
elementType: N N N N N C C C C C C C C C C C
charge: -0.122422 -0.113753 -0.041256 -0.032255 -0.017554 0.247616 0.028173 -0.001305 0.049708 0.088476 -0.120609 0.229132 0.216718 -0.132316 -0.133284 -0.145070
polarizability: 2.28784030e+02 -1.02116907e+01 1.56852539e+02 6.37753607e-02 5.75178349e+00 8.83339635e+01
1716.lowfreq: -6.7768 -3.3008 0.0004 0.0006 0.0007 9.1436 37.2513 38.7705 53.7928
frequency: 37.1249 38.7388 53.7831 71.8214 93.8466 121.2238 152.8937 211.1654 222.3457 271.8826 276.1868 292.8308 314.0250 393.8288 422.6818 458.6356 505.7387 519.9365 540.7405 582.7839 616.2548 637.6228 660.8116 665.8923 686.0009 698.2011 789.8898 828.9671 830.7839 889.6704 896.3639 911.5382 924.2870 937.6160 943.0540 955.2549 959.8309 989.0580 1004.5353 1011.2773 1044.7705 1080.3513 1096.1085 1132.5110 1166.9201 1185.3060 1236.2451 1259.3643 1274.2982 1281.8407 1283.9050 1288.6077 1330.1124 1336.3037 1336.8966 1343.5287 1369.3257 1390.6951 1416.7060 1425.1410 1428.4938 1447.6553 1472.0620 1483.3828 1547.8046 1563.4264 1654.0044 1656.4366 2997.3605 3007.2259 3060.4727 3069.7021 3085.9285 3086.9772 3108.7121 3109.5425 3160.1450 3196.7545 3197.7263 3230.4792 3620.2271
redmass: 4.1660 4.2892 4.1051 3.9390 2.5395 3.5953 2.5337 3.1769 6.3327 3.6136 3.7979 3.4562 4.4668 2.5449 1.8607 3.0805 4.1140 2.5908 3.9915 2.5949 2.4978 2.9675 1.5153 8.1458 3.5050 2.6041 4.0929 5.0598 1.6411 3.8192 1.4071 3.9868 1.6489 1.4370 2.0536 1.3471 1.3564 2.1983 1.2014 1.2219 4.5146 3.4716 2.2914 3.1087 2.6736 2.6522 1.6879 1.5967 2.0758 1.4754 1.4051 1.2329 1.5286 2.2532 2.1849 1.9774 2.2109 3.1776 2.0698 1.2276 1.2019 1.1983 1.4057 1.9238 6.2809 6.5451 4.5400 4.5704 1.0608 1.0597 1.1019 1.1008 1.0602 1.0604 1.0950 1.0951 1.0921 1.1141 1.1143 1.0972 1.0824
irintensity: 0.1121 0.0058 0.0031 0.5468 0.1508 0.5751 0.2695 0.9524 0.2659 2.1004 1.8396 0.2444 2.5511 9.4982 6.1753 3.1893 0.4389 3.7120 0.7907 0.6075 40.6510 3.8763 83.5320 4.8974 4.7058 24.1188 21.7897 18.8845 16.7943 15.8044 4.3058 57.8495 41.9247 9.8029 15.9803 74.3147 78.4380 5.3663 11.6546 18.4913 8.7941 17.0866 40.3560 13.9942 8.1010 2.2583 9.1905 60.4594 12.7016 4.7814 1.6398 1.2058 84.2327 6.6011 100.9148 4.2285 1.3831 53.5527 12.7633 37.7456 18.6813 22.2708 31.8832 13.6938 173.6234 604.8410 28.9000 4.4256 43.0349 19.6524 7.9062 6.7201 8.3669 14.8361 5.6787 6.8836 22.8856 35.5838 8.3292 2.2451 109.7500
temp: 298.150 k
press: 1.00000 atm
elementType: 7 7 7 7 7 6 6 6 6 6 6 6 6 6 6 6 1 1 1 1 1 1 1 1 1 1 1 1 1
symmnumber: 1
zpe: 603411.8 jmol-1
zpe.correction: 0.229827 hartree
zpe.thermalcorrener: 0.244367 hartree
zpe.thermalcorrenthalpy: 0.245311 hartree
zpe.thermalcorrgfe: 0.186835 hartree
zpe.sumelectzpe: -699.504239 hartree
zpe.sumelectthermal: -699.489699 hartree
zpe.sumelectthermalent: -699.488755 hartree
zpe.sumelectthermalfe: -699.547231 hartree
dipole: -3.1029 1.3552 0.2504
dipole: 3.3952
quadrupole: -88.0717 -99.5277 -94.9209
quadrupole: -3.1284 -1.1120 -3.7429
quadrupole: 6.1017 -5.3543 -0.7475 -3.1284 -1.1120 -3.7429
hfenergy: -699.734066 hartree
pointgroup: C01 [X(C11H13N5)]
dipole: -1.2593129 -0.06129 -0.4411895 debye
polarizability: 224.758495|-18.6715542|133.0173797|19.7763787|30.2638794|116.1946575 unknown
InChI: InChI=1S/C11H13N5/c1-3-5-16(6-4-2)11-9-7-14-15-10(9)12-8-13-11/h3-4,7-8,15H,1-2,5-6H2
charge 0 multiplicity 1
29 atoms
N  -0.945247 0.341323 0.087026
N  0.772234 1.039821 1.531931
N  3.497788 -1.268952 -0.428798
N  3.119411 0.359286 1.366349
N  2.771134 -1.961506 -1.399699
C  0.381786 0.272535 0.455274
C  1.375711 -0.54081 -0.207369
C  -1.480859 -0.341463 -1.112412
C  -1.927439 1.094338 0.914424
C  2.7108 -0.416809 0.317593
C  1.492096 -1.520101 -1.260613
C  -1.979169 -1.747102 -0.81165
C  -2.37272 2.377385 0.239928
C  2.079817 1.041613 1.920904
C  -3.236496 -2.177575 -1.079193
C  -3.658824 2.669647 -0.078426
H  -2.308994 0.276104 -1.504676
H  -0.698611 -0.351693 -1.892196
H  -2.796125 0.436553 1.107871
H  -1.423427 1.323001 1.869052
H  0.736027 -1.943285 -1.917755
H  4.496268 -1.437837 -0.328373
H  -1.255789 -2.42615 -0.337981
H  -1.57108 3.097456 0.021464
H  2.318809 1.674168 2.781293
H  -3.554444 -3.200868 -0.850989
H  -3.982831 -1.521209 -1.545135
H  -3.934661 3.623352 -0.54168
H  -4.476864 1.969181 0.135035
