program: Gaussian 09
title: 000231434
version: EM64L-G09RevD.01
frameworkgroup: C1[X(C12H10N2)]
method: RPBEPBE
basis: SDD
operation: Freq
keyword: #pfreq=noraman
keyword: PBEPBE/SDD
title: #p freq=noraman PBEPBE/SDD
converged: NO YES NO NO
title: Mulliken charges:
elementType: N N C C C C C C C C C C C C H H H H H H H H H H
charge: 0.022553 -0.595525 -0.197563 0.395682 -0.692661 0.274912 -0.040097 0.496254 -0.452986 -0.428213 -0.441249 -0.443672 -0.221859 -0.207515 0.238796 0.239754 0.242293 0.262235 0.236387 0.236029 0.218888 0.219291 0.314427 0.323839
chargesum: 0.00000
title: Mulliken charges with hydrogens summed into heavy atoms:
elementType: N N C C C C C C C C C C C C
charge: 0.022553 0.042741 -0.197563 0.395682 -0.214111 0.274912 -0.040097 0.496254 -0.210693 -0.165979 -0.204862 -0.207643 -0.002971 0.011775
polarizability: 2.27537852e+02 4.53049985e+00 1.78254389e+02 -1.82775824e-02 1.41369195e-02 5.82463166e+01
1716.lowfreq: -4.5910 -3.0875 -0.0008 -0.0008 -0.0007 6.5930 84.3741 160.8122 165.4125
frequency: 84.3709 160.8121 165.4124 174.4925 243.4152 280.1806 304.8863 335.9091 390.6884 424.2142 466.0408 474.6428 477.6197 529.8828 549.3585 561.0832 609.7457 629.3220 648.7901 670.2373 761.9018 771.3095 785.1790 794.1139 837.7852 892.5977 916.6334 941.9740 954.8341 977.7812 984.3714 1015.1266 1031.1151 1047.3945 1116.5259 1128.8458 1141.4381 1173.1252 1184.5998 1207.8292 1211.9755 1238.8217 1265.1647 1319.5187 1370.3863 1396.8344 1418.5905 1435.6111 1464.6352 1469.2934 1498.7846 1588.7192 1604.5006 1616.3809 1628.3260 1647.6677 2953.8835 2995.8322 3120.3403 3122.6014 3134.5564 3144.3242 3153.5268 3165.1211 3458.5959 3683.6182
redmass: 4.3100 4.0908 3.1315 3.9184 3.0199 1.3762 2.9688 5.1892 1.6786 4.1361 3.1128 6.6973 3.0777 5.6475 7.0015 1.8148 3.1404 4.8223 3.1945 4.4813 1.2521 4.0116 1.7517 5.2283 2.3380 1.4486 1.4943 6.2727 1.9471 1.3957 1.3648 3.6557 2.6002 2.1475 3.7391 2.3504 1.1293 1.2149 1.2431 1.3502 1.6824 1.7579 2.3087 2.7215 3.0267 4.1869 1.8833 1.2098 5.5206 3.1627 4.2949 6.4481 6.3914 6.8896 6.0423 1.2833 1.0590 1.1003 1.0856 1.0861 1.0922 1.0940 1.0984 1.0963 1.0481 1.0980
irintensity: 0.4748 6.9713 5.6214 11.6435 4.5436 150.8500 149.1571 0.4852 29.9593 7.2924 0.2706 1.5900 0.8375 0.4121 1.5593 3.1385 1.3379 0.2491 2.1028 1.9607 2.9732 14.2071 75.6825 0.6825 64.2010 4.0731 0.3501 18.7155 1.6895 0.6051 3.7691 2.9952 10.2566 1.1037 91.3458 59.0855 0.8676 0.9707 15.8419 6.6091 19.0983 5.5951 4.3483 16.9395 8.0975 0.9486 0.3410 4.8306 0.7811 1.9438 5.5339 142.9360 79.9375 6.6247 8.4404 9.1584 21.6960 15.6953 1.0363 3.1204 19.6955 30.9956 42.9637 16.6588 33.2052 70.8687
temp: 298.150 k
press: 1.00000 atm
elementType: 7 7 6 6 6 6 6 6 6 6 6 6 6 6 1 1 1 1 1 1 1 1 1 1
symmnumber: 1
zpe: 496170.3 jmol-1
zpe.correction: 0.188981 hartree
zpe.thermalcorrener: 0.199646 hartree
zpe.thermalcorrenthalpy: 0.200590 hartree
zpe.thermalcorrgfe: 0.153122 hartree
zpe.sumelectzpe: -571.807478 hartree
zpe.sumelectthermal: -571.796814 hartree
zpe.sumelectthermalent: -571.795869 hartree
zpe.sumelectthermalfe: -571.843337 hartree
dipole: -1.6033 -2.2758 -0.0233
dipole: 2.7840
quadrupole: -62.2011 -71.2408 -87.1892
quadrupole: 7.6605 0.1147 0.0217
quadrupole: 11.3426 2.3029 -13.6455 7.6605 0.1147 0.0217
hfenergy: -571.9964592 hartree
pointgroup: C01 [X(C12H10N2)]
dipole: 0.6194228 -0.902603 0.0360642 debye
dipolederiv: 1.2093024 -0.3526251 0.0358 -0.9688103 -0.1584074 -0.0228316 0.0406794 -0.0081884 -0.0891382 -1.3116463 0.2016384 -0.0151779 1.1456886 -0.1583648 0.0176603 -0.0145502 -0.0072743 -0.7319841 -0.2726461 0.0860518 -0.0065043 0.001449 -0.072689 0.0003121 -0.0052032 0.0027778 -0.0553098 0.29184 -0.070035 0.0084204 0.046197 0.0424749 0.0001431 0.0063713 -0.0024576 -0.0210075 -0.0831204 -0.048673 -0.0070703 0.0255869 -0.1072083 0.0040896 -0.0069538 0.0020369 0.2395272 0.4755217 -0.1457098 0.0128785 -0.2825658 0.023379 -0.0070126 0.0144563 -0.0039225 0.0293083 -0.4544855 0.2857616 -0.0123287 -0.1248144 0.356785 -0.0077326 -0.0064754 0.0024172 -0.071093 -0.0586767 0.072762 -0.0048131 0.1409668 0.2012923 0.00206 -0.0058192 0.0002631 0.1011333 -0.2553528 -0.0267837 -0.0011427 -0.1658562 0.0641461 -0.0070778 0.0007106 -0.0036895 -0.2006191 -0.0709707 0.085427 0.0016875 0.3192552 -0.1292465 0.0071837 -0.0013999 0.0014791 -0.1833911 0.1336596 -0.0214787 0.0084162 -0.0374611 -0.1171467 -0.0019557 0.0086999 -0.0016612 -0.2028811 -0.0671402 -0.0958496 0.00484 -0.0220808 -0.1073634 -0.0019275 0.0040765 -0.0038507 -0.2183035 0.1746632 0.0026203 0.0078732 0.0090664 0.0182551 -0.0019294 0.0076923 -0.0020683 -0.1514427 0.1157727 -0.0397712 0.0066905 -0.1528811 0.1437754 -0.0074537 0.0083476 -0.0045702 -0.1392196 -0.0290127 0.0520223 -0.0674453 -0.0036657 0.0139776 0.0680954 -0.0694833 0.0981737 -0.0305614 -0.0345678 0.0574179 0.0650969 0.0006119 0.0109518 -0.068694 0.0683464 -0.0958714 -0.0198952 0.0735465 0.0576056 -0.0027609 0.0225315 -0.1197043 0.0039215 -0.0023114 0.0048011 0.159214 -0.0120358 -0.0949245 -0.0030394 -0.0673452 0.0212941 0.0001418 -0.003463 -0.0005648 0.1611898 -0.1127384 0.0223863 -0.0068457 0.0860311 0.0572188 0.0033674 -0.0076779 0.0018933 0.1594578 -0.0919281 0.1020232 -0.0075354 0.0405217 0.0414885 0.0025647 -0.0067782 0.0041436 0.1630739 -0.0573629 -0.1187838 -0.0036821 -0.1335138 -0.0225378 -0.0010142 -0.0035009 -0.0006777 0.1565181 0.0781183 0.0323043 -0.0022544 0.0515678 -0.1581275 0.0052884 -0.002509 0.0047257 0.1534613 0.0981347 -0.028658 -0.0068095 -0.0206067 0.0083187 0.0071541 -0.0126087 0.0086776 0.3933622 0.2611254 -0.0147282 -0.0042936 0.0901272 0.1474385 0.0056471 -0.0106461 0.0034075 0.3986003 unknown
polarizability: 227.3160767|-5.0735103|178.3490557|4.2612387|-1.6655597|58.3734253 unknown
InChI: InChI=1S/C12H10N2/c13-14-11-7-9-5-1-3-8-4-2-6-10(11)12(8)9/h1-6H,7,13H2
charge 0 multiplicity 1
24 atoms
N  3.102418 0.394331 0.105452
N  4.138607 -0.500775 0.142262
C  -0.473613 -0.029407 0.020415
C  -0.133623 -1.413626 0.045808
C  1.389706 -1.537752 0.083565
C  0.681736 0.814698 0.038076
C  1.863224 -0.062306 0.078894
C  -1.812452 0.45999 -0.018313
C  -1.159076 -2.359626 0.032679
C  0.504494 2.205277 0.01565
C  -2.851049 -0.532884 -0.030667
C  -1.967945 1.887926 -0.040531
C  -2.521445 -1.896738 -0.005722
C  -0.833326 2.719981 -0.023804
H  1.739195 -2.075273 0.989985
H  1.781337 -2.094692 -0.793546
H  -0.953032 -3.435617 0.050661
H  1.362004 2.884597 0.028008
H  -3.90227 -0.222579 -0.059886
H  -2.971594 2.327894 -0.0707
H  -3.326753 -2.64057 -0.015944
H  -0.97329 3.807339 -0.041208
H  4.014788 -1.51709 0.160856
H  5.069761 -0.100096 0.165712
