program: Gaussian 09
title: 000231433
version: EM64L-G09RevD.01
frameworkgroup: C1[X(C12H8N2O)]
method: RPBEPBE
basis: SDD
operation: Freq
keyword: #p
keyword: freq=noraman
keyword: PBEPBE/SDD
title: #p freq=noraman PBEPBE/SDD
converged: NO YES NO NO
title: Mulliken charges:
elementType: O N N C C C C C C C C C C C C H H H H H H H H
charge: -0.251380 0.061154 -0.556068 -0.192030 0.437851 0.397714 0.522267 -0.266118 -0.178441 -0.447703 -0.438017 -0.432453 -0.415550 -0.205618 -0.216527 0.268907 0.275714 0.240375 0.241501 0.224000 0.229052 0.372738 0.328631
chargesum: 0.00000
title: Mulliken charges with hydrogens summed into heavy atoms:
elementType: O N N C C C C C C C C C C C C
charge: -0.251380 0.061154 0.145301 -0.192030 0.437851 0.397714 0.522267 -0.266118 -0.178441 -0.178795 -0.162303 -0.192078 -0.174049 0.018382 0.012525
polarizability: 2.33975994e+02 -3.06107169e+00 1.85103583e+02 -2.03138770e-03 3.43093062e-03 5.42720764e+01
1716.lowfreq: -7.8904 -6.7065 -1.3793 -0.0009 -0.0009 -0.0008 89.9065 129.2352 174.0793
frequency: 89.9061 129.2335 174.0785 190.1355 230.1931 304.3037 305.8857 344.7453 371.0624 440.2339 446.2680 462.8376 477.5570 527.1056 563.6883 576.1023 580.0548 622.7443 638.5908 684.4957 743.2196 783.7743 787.9234 793.0649 836.3779 861.9576 897.2263 904.1666 921.6498 942.3603 985.1912 994.7322 1008.9764 1035.3947 1069.4564 1102.8605 1171.3930 1186.4586 1207.5739 1231.8840 1242.5025 1268.2946 1322.5219 1361.6683 1399.2728 1421.9423 1460.6275 1462.2967 1491.0709 1515.0484 1558.5178 1610.0701 1614.7284 1627.1504 1633.8609 3128.4960 3129.2075 3147.4408 3149.1438 3164.5434 3166.0549 3298.7430 3641.2803
redmass: 5.7649 6.6835 3.9949 4.5077 4.1664 8.6669 5.1257 5.0901 3.9174 6.2124 4.3469 3.2116 6.0819 6.2496 6.6883 1.4056 7.3135 2.8115 3.5449 6.8361 1.5235 1.3896 1.6309 5.2506 2.5025 2.9602 5.5952 6.8907 1.4599 1.4741 1.3726 1.3892 3.3801 2.1710 2.9181 2.6441 1.2132 1.2321 2.7241 1.8894 2.1334 2.9183 2.2791 2.7292 3.8376 1.9602 6.7419 3.8803 3.8489 5.0189 4.1839 6.9869 7.6561 1.8027 4.1994 1.0871 1.0863 1.0923 1.0934 1.0979 1.0972 1.0564 1.0935
irintensity: 5.5972 0.8538 4.7251 6.7926 0.8080 9.5473 0.1387 0.6108 0.0018 6.7940 5.0275 0.0910 3.8216 1.8756 1.0088 184.1424 4.7614 35.3493 0.3967 0.0445 33.6285 78.4558 28.7806 0.6218 56.4021 51.8771 35.2313 8.7707 0.9303 0.0268 0.9647 2.6456 14.0543 35.9134 59.8092 8.2966 1.0534 13.6448 100.6710 23.9493 10.9779 27.7201 30.3959 1.3117 5.2238 1.1201 26.6382 25.7486 17.1911 111.0094 440.7091 10.7649 5.6422 4.2900 1.9021 3.1571 1.5747 10.5627 25.1833 30.5163 13.2432 48.0462 96.0332
temp: 298.150 k
press: 1.00000 atm
elementType: 8 7 7 6 6 6 6 6 6 6 6 6 6 6 6 1 1 1 1 1 1 1 1
symmnumber: 1
zpe: 451227.5 jmol-1
zpe.correction: 0.171863 hartree
zpe.thermalcorrener: 0.182567 hartree
zpe.thermalcorrenthalpy: 0.183511 hartree
zpe.thermalcorrgfe: 0.135719 hartree
zpe.sumelectzpe: -645.786031 hartree
zpe.sumelectthermal: -645.775328 hartree
zpe.sumelectthermalent: -645.774384 hartree
zpe.sumelectthermalfe: -645.822175 hartree
dipole: 0.9588 0.9245 0.0120
dipole: 1.3320
quadrupole: -64.1718 -81.4563 -90.5774
quadrupole: -5.1235 -0.0441 0.0091
quadrupole: 14.5634 -2.7211 -11.8422 -5.1235 -0.0441 0.0091
hfenergy: -645.9578943 hartree
pointgroup: C01 [X(C12H8N2O1)]
dipole: 0.3840246 -0.3560805 -0.0188173 debye
dipolederiv: -0.867957 0.4322618 0.0180514 0.2478553 -0.7859162 -0.010134 0.0170451 -0.0158764 -0.3455381 1.5521431 0.3014595 -0.046725 -0.5144161 -0.1725509 0.0148661 -0.0519714 -0.010155 -0.0835642 -1.485958 -0.1742597 0.0270602 0.8707053 -0.0130518 -0.0219005 0.0384617 0.0105575 -0.5892035 -0.2968584 0.1588561 0.0079905 -0.2551663 0.0412091 0.0083355 0.0049603 -0.0042961 -0.0729506 0.4274059 -0.1952441 -0.0133123 -0.0991522 -0.0342815 0.0023767 -0.0120611 0.0050449 0.0436729 -0.8291342 0.0261086 0.0257117 -0.1073405 -0.02325 0.0027705 0.0249114 -0.000733 0.0275266 -0.0463495 -0.1292522 0.0035236 -0.0428998 0.0339123 0.0008327 0.004139 0.0035511 0.1051894 -0.5638261 -0.144462 0.0149524 -0.7936971 -0.4515138 0.0209556 0.0086619 0.0018773 -0.0357867 1.4063905 -0.2734502 -0.0380527 0.3603325 0.9594509 -0.0060215 -0.033661 0.0130394 0.178473 -0.0198399 0.177642 -0.0031076 0.1828709 -0.0796708 -0.0046871 -0.0027871 -0.0048998 -0.1665423 0.2083632 -0.1767461 -0.0116102 0.0902572 0.0583314 -0.0014064 -0.0100523 0.0064409 -0.1345802 0.0149538 -0.0696094 -0.0071989 0.0473898 0.0007101 0.0002312 -0.0062567 0.0038382 -0.2038686 0.1753565 0.0503537 -0.0097253 -0.1249495 0.1342664 0.0058527 -0.0109742 0.0006106 -0.1586767 0.0191421 -0.1808733 -0.0061018 -0.1632967 0.0818543 0.0067071 -0.0061208 0.0071644 -0.1389703 -0.1311878 0.2169225 0.0007082 0.2530696 -0.0573253 -0.0069355 0.0009821 -0.0057377 -0.1573505 0.0287943 -0.0877795 0.0032892 -0.0607748 -0.0020576 0.0005569 0.0035627 0.0014707 0.1606887 0.0778856 0.0677429 0.0029097 0.0311084 -0.0316469 -0.0022892 0.0027072 -0.0032826 0.15854 -0.1058649 0.0629376 0.0085947 0.0052538 0.0712959 -0.0008788 0.0081995 -0.0027045 0.1623052 -0.1084024 -0.0166954 0.0077397 0.0396663 0.0804502 -0.001733 0.0081758 -0.0000136 0.1522545 0.0516104 0.0711896 0.0037085 0.092131 -0.1159685 -0.0049006 0.0037986 -0.0042367 0.1562899 -0.0017552 -0.1041986 0.0041429 -0.1165497 -0.059445 0.0019219 0.0041111 0.001535 0.1607858 0.2234527 -0.0121975 0.0050275 -0.0158299 0.177616 -0.0007861 0.0031684 -0.0011546 0.4093261 0.2716354 -0.0007063 0.0024236 0.0734325 0.1875819 -0.0037341 0.0009999 -0.0020398 0.3719796 unknown
polarizability: 233.6767473|4.0617304|185.2379919|-5.315881|0.85874|54.4369141 unknown
InChI: InChI=1S/C12H8N2O/c13-14-11-8-5-1-3-7-4-2-6-9(10(7)8)12(11)15/h1-6H,13H2
charge 0 multiplicity 1
23 atoms
O  -2.43182 1.883155 0.128664
N  -2.822747 -1.132369 0.119262
N  -3.961261 -0.406645 0.15799
C  0.621129 -0.017446 0.025678
C  -0.328227 -1.091166 0.045662
C  -0.008261 1.265394 0.0537
C  2.029684 -0.201519 -0.018479
C  -1.661814 -0.465835 0.091202
C  -1.479982 1.025613 0.094931
C  0.149694 -2.40407 0.020572
C  0.779376 2.420578 0.038122
C  2.497613 -1.561299 -0.043519
C  2.819391 0.99777 -0.033649
C  1.571498 -2.617002 -0.0240
C  2.203688 2.264389 -0.005926
H  -0.534523 -3.257777 0.034644
H  0.32627 3.416761 0.058476
H  3.572519 -1.771745 -0.077753
H  3.913158 0.927064 -0.067269
H  1.941739 -3.648355 -0.043199
H  2.832925 3.161175 -0.018593
H  -3.931359 0.627538 0.162673
H  -4.825091 -0.941607 0.175912
