program: Gaussian 09
title: 000231430
version: EM64L-G09RevD.01
frameworkgroup: C1[X(C11H10N6)]
method: RPBEPBE
basis: SDD
operation: Freq
keyword: #pfreq=noraman
keyword: PBEPBE/SDD
title: #p freq=noraman PBEPBE/SDD
converged: YES YES NO NO
title: Mulliken charges:
elementType: N N N N N N C C C C C C C C C C C H H H H H H H H H H
charge: -0.277237 -0.067992 -0.108928 -0.113335 -0.621842 -0.591084 0.170808 -0.139550 0.433791 -0.250442 0.184876 -0.361189 -0.346210 -0.013960 -0.227915 -0.227648 -0.245175 0.261235 0.233174 0.300536 0.228099 0.227606 0.230646 0.326131 0.343656 0.323876 0.328073
chargesum: 0.00000
title: Mulliken charges with hydrogens summed into heavy atoms:
elementType: N N N N N N C C C C C C C C C C C
charge: -0.277237 -0.067992 -0.108928 -0.113335 0.047945 0.060865 0.170808 -0.139550 0.433791 0.010794 0.184876 -0.128015 -0.045674 -0.013960 0.000184 -0.000042 -0.014529
polarizability: 2.51351581e+02 -3.54658550e-01 1.83710593e+02 2.42415704e+00 -4.96176480e+00 6.63785732e+01
1716.lowfreq: -10.3031 -0.0005 -0.0005 -0.0002 1.8584 6.1877 32.3253 56.7591 101.3492
frequency: 32.2634 56.7521 101.3470 137.2076 176.6576 222.1608 241.2712 256.3294 292.2458 320.1949 359.4452 406.0270 411.0049 427.3503 489.8715 491.9152 510.3638 518.4120 542.6665 559.5100 610.8099 616.7511 631.3321 645.6163 662.1285 695.9892 700.3619 715.7447 766.4347 770.5868 796.5708 798.1465 841.4289 909.3848 916.5662 950.0230 973.4854 987.5436 995.4393 1017.5455 1030.2470 1078.6915 1089.8611 1128.4200 1167.2820 1176.1231 1196.4392 1225.4756 1280.4751 1309.0659 1334.8770 1341.1404 1375.8661 1385.9737 1432.8671 1447.0232 1461.6435 1481.8865 1500.0541 1564.6944 1578.0853 1596.4206 1599.8265 1615.5335 1633.8835 3130.1210 3139.7258 3154.0128 3167.1043 3179.5172 3246.4253 3543.5011 3567.3398 3699.0253 3727.3589
redmass: 3.8778 5.3823 5.1274 6.1968 5.0221 6.4905 4.3636 4.1034 4.7458 4.0768 6.5840 2.9465 4.4018 1.2192 7.5818 1.2175 3.0231 1.0855 1.0629 5.6848 5.4451 5.1658 3.8544 6.0085 7.2877 2.0796 6.5968 11.3597 1.6410 2.0491 4.0055 8.9123 1.2540 3.3127 1.4326 5.0679 1.3736 4.3775 1.4307 3.0429 2.2321 1.9989 2.3444 2.0615 3.3287 1.1376 1.1503 2.0680 3.0381 4.5204 1.4046 4.8132 6.9168 7.6812 4.0268 3.0737 4.2102 2.7347 2.7302 3.7223 2.9358 5.3369 1.5599 5.3133 2.5887 1.0850 1.0893 1.0939 1.0989 1.0973 1.0976 1.0441 1.0440 1.1056 1.1059
irintensity: 0.4860 1.2775 0.7462 1.3993 10.3080 5.7047 3.1943 2.2948 0.9680 9.7534 0.5517 0.8269 2.3261 246.2637 2.5175 284.8387 11.7290 47.8591 3.7935 2.5766 0.5221 1.6845 17.9560 5.3695 8.4380 39.3437 27.9966 8.6296 100.8238 18.6385 1.0973 0.4177 0.8659 31.6418 9.2097 11.7172 1.1606 0.4015 1.3553 3.5931 4.5045 17.7915 13.4766 3.1027 35.3996 5.3440 0.5596 5.2594 110.3252 9.1403 1.5029 84.7320 87.0304 76.4761 37.1113 15.8325 93.6869 101.5214 218.4092 183.1212 159.8879 16.1203 548.4754 159.7488 454.0199 1.1510 13.5715 29.5557 12.3571 15.8588 0.4444 120.2697 116.2486 46.8904 43.8968
temp: 298.150 k
press: 1.00000 atm
elementType: 7 7 7 7 7 7 6 6 6 6 6 6 6 6 6 6 6 1 1 1 1 1 1 1 1 1 1
symmnumber: 1
zpe: 539162.1 jmol-1
zpe.correction: 0.205356 hartree
zpe.thermalcorrener: 0.218743 hartree
zpe.thermalcorrenthalpy: 0.219687 hartree
zpe.thermalcorrgfe: 0.165050 hartree
zpe.sumelectzpe: -752.535811 hartree
zpe.sumelectthermal: -752.522424 hartree
zpe.sumelectthermalent: -752.521479 hartree
zpe.sumelectthermalfe: -752.576116 hartree
dipole: 0.1393 0.8473 0.1006
dipole: 0.8645
quadrupole: -75.9077 -84.0943 -103.9809
quadrupole: -1.9453 0.5427 -1.5933
quadrupole: 12.0866 3.9000 -15.9866 -1.9453 0.5427 -1.5933
hfenergy: -752.7411667 hartree
pointgroup: C01 [X(C11H10N6)]
dipole: -0.0602004 -0.333394 0.030119 debye
polarizability: 251.3067028|-1.3785734|183.3525719|-2.8990699|8.39516|66.7814727 unknown
InChI: InChI=1S/C11H10N6/c12-9-8-10(16-11(13)15-9)17(6-14-8)7-4-2-1-3-5-7/h1-6H,12-13H2
charge 0 multiplicity 1
27 atoms
N  -0.492057 0.761578 -0.034201
N  1.239767 2.284263 -0.084479
N  0.866538 -1.341519 0.027358
N  3.297294 -0.872751 0.045075
N  4.16069 1.321503 -0.025922
N  2.464915 -3.052986 0.114587
C  0.703072 0.009079 -0.013049
C  1.746703 0.972384 -0.033994
C  -1.844685 0.284002 -0.00933
C  -0.089185 2.122911 -0.082567
C  3.083124 0.475034 -0.005312
C  -2.889767 1.147975 0.408034
C  -2.140978 -1.04499 -0.404892
C  2.195109 -1.702407 0.061548
C  -4.224282 0.691859 0.399841
C  -3.479662 -1.490315 -0.398267
C  -4.528817 -0.627987 -0.00533
H  -0.809594 2.932749 -0.154148
H  -2.668746 2.16093 0.759305
H  -1.323761 -1.711999 -0.68874
H  -5.024503 1.366671 0.723035
H  -3.701456 -2.518454 -0.705171
H  -5.565874 -0.979977 -0.006519
H  5.100335 0.932547 -0.00276
H  4.007349 2.326816 -0.063493
H  1.693424 -3.712668 0.146095
H  3.432447 -3.360448 0.140395
