program: Gaussian 09
title: 000231403
version: EM64L-G09RevD.01
frameworkgroup: C1[X(C10H12N2O)]
method: RPBEPBE
basis: SDD
operation: Freq
keyword: #p
keyword: freq=noraman
keyword: PBEPBE/SDD
title: #p freq=noraman PBEPBE/SDD
converged: YES YES NO NO
title: Mulliken charges:
elementType: O N N C C C C C C C C C C H H H H H H H H H H H H
charge: -0.291660 -0.160435 -0.403081 -0.348392 -0.374786 -0.553782 0.241177 0.479607 -0.429582 -0.360355 -0.221202 -0.230484 -0.240470 0.224785 0.239767 0.228529 0.225892 0.221524 0.260374 0.319583 0.228650 0.263744 0.224887 0.227429 0.228282
chargesum: 0.00000
title: Mulliken charges with hydrogens summed into heavy atoms:
elementType: O N N C C C C C C C C C C
charge: -0.291660 -0.160435 -0.083499 0.116161 0.079634 -0.071885 0.241177 0.479607 -0.200932 -0.096611 0.003685 -0.003055 -0.012188
polarizability: 1.42363981e+02 -9.25467234e+00 1.12661433e+02 -5.75954335e+00 -9.33004457e+00 9.21782282e+01
1716.lowfreq: -16.9154 -9.9376 -0.0006 -0.0006 -0.0005 8.9976 22.0733 46.8530 55.7856
frequency: 21.9413 46.4601 55.7530 143.9366 183.5654 199.2665 213.7694 294.2646 352.9062 405.1045 454.1887 460.5679 490.5649 583.4764 615.9483 648.1575 687.4755 702.3027 711.4956 742.9771 788.6346 807.8869 860.9439 885.3960 915.9999 937.8540 962.0470 982.2470 989.3440 1000.0578 1025.7192 1051.8060 1079.5336 1104.8948 1112.3917 1171.9669 1175.1167 1187.6514 1196.4024 1201.7084 1229.2460 1263.7575 1288.3066 1305.1372 1330.3105 1353.6750 1383.1508 1388.4601 1413.7163 1442.1726 1456.7517 1483.1692 1497.7742 1501.7431 1594.5829 1613.0534 1669.3078 2960.0322 2962.0967 2987.6205 3039.5792 3048.1298 3057.2436 3111.8687 3122.3473 3133.2070 3144.8262 3161.9269 3620.2276
redmass: 4.3209 4.6038 4.3906 2.6044 3.2737 4.1195 5.2684 4.7620 1.9815 2.8318 1.9697 1.5579 4.5657 4.6821 6.2574 3.9967 4.7846 5.2292 2.2220 2.1690 2.9323 3.3861 1.2441 1.6065 1.5410 1.9763 2.1477 1.3848 5.8225 1.3316 2.2515 2.1245 1.8977 1.6585 2.2759 1.0606 1.4033 1.1170 1.3854 1.9818 2.0198 3.1491 1.4824 1.3846 1.3050 1.3346 5.2710 1.7141 2.3411 2.0957 1.1294 2.1550 1.1203 1.0897 6.0414 6.0085 8.0791 1.0706 1.0632 1.0605 1.0957 1.1014 1.0999 1.0874 1.0864 1.0914 1.0961 1.1015 1.0794
irintensity: 0.8828 4.3295 2.5042 2.1293 4.5859 6.4784 7.0748 11.4710 5.6578 0.1004 57.9035 84.1109 14.7100 9.2914 0.6503 28.6883 9.6437 22.0599 65.1000 23.8301 5.7422 10.1028 0.0779 4.7199 2.2350 5.9649 8.9736 0.0602 0.2208 1.1019 6.4395 12.9882 39.1132 2.8874 3.6441 0.6587 10.7111 2.4572 3.9170 2.0983 65.6333 191.8551 25.3156 9.1025 2.1382 10.9262 8.0029 6.8930 121.7523 5.7526 30.9491 11.8612 27.9278 4.0604 1.3102 3.6011 386.9719 55.7877 71.4636 45.5078 38.4889 5.3854 44.4144 9.6274 0.0505 11.0610 35.0334 25.9885 47.5616
temp: 298.150 k
press: 1.00000 atm
elementType: 8 7 7 6 6 6 6 6 6 6 6 6 6 1 1 1 1 1 1 1 1 1 1 1 1
symmnumber: 1
zpe: 538410.1 jmol-1
zpe.correction: 0.205070 hartree
zpe.thermalcorrener: 0.216419 hartree
zpe.thermalcorrenthalpy: 0.217363 hartree
zpe.thermalcorrgfe: 0.165891 hartree
zpe.sumelectzpe: -572.053852 hartree
zpe.sumelectthermal: -572.042503 hartree
zpe.sumelectthermalent: -572.041559 hartree
zpe.sumelectthermalfe: -572.093031 hartree
dipole: -0.1895 -4.1425 -2.0093
dipole: 4.6079
quadrupole: -66.8552 -78.3966 -75.5094
quadrupole: 6.7594 4.9486 -5.5627
quadrupole: 6.7319 -4.8095 -1.9224 6.7594 4.9486 -5.5627
hfenergy: -572.2589219 hartree
pointgroup: C01 [X(C10H12N2O1)]
dipole: -0.2161513 1.625453 0.7731718 debye
dipolederiv: -0.6126846 -0.008855 0.0924905 -0.098015 -1.1524077 -0.3215192 0.1036247 -0.2982602 -0.5499834 -0.9852813 -0.2127342 0.0674465 -0.415252 -0.8619512 0.069694 0.2492942 0.0977115 -0.5236868 -0.7614684 0.1462534 0.1954247 0.211877 -0.5447614 -0.1122112 0.5023681 -0.1131274 -0.8608278 0.1053775 -0.1097977 0.1225134 -0.0932853 0.4322177 0.0659531 0.1385314 0.1365784 0.3192344 0.1663154 -0.0596314 0.1582439 -0.2803265 0.4990965 0.1069393 0.0894459 0.0353156 0.3045269 0.7191076 -0.0100485 -0.067944 -0.1058407 0.1195481 -0.1301924 -0.2128972 -0.1422929 0.3825708 1.2412554 0.1970448 -0.5706938 0.4910482 1.593948 0.3335929 -0.7531794 0.2921903 0.8501551 0.0906495 0.0183181 0.1160876 0.0263715 -0.0317265 0.0218766 0.1467058 0.0277947 -0.0821797 -0.1679487 -0.0027012 0.034087 0.0220892 -0.0021258 -0.1135343 0.0061019 -0.1166077 -0.056181 -0.1004652 0.0777055 -0.0068395 0.1077766 -0.0346656 -0.0324899 -0.0475569 -0.0269547 -0.1274992 0.0122439 0.1119587 0.0278488 0.1137468 0.0213363 -0.0433384 0.0070039 -0.0511496 -0.0985952 -0.0574783 -0.0009366 0.0518096 -0.0085545 0.0442834 -0.1230451 0.0611915 -0.1277326 -0.0348466 0.0080788 0.0227663 0.1157797 0.0122514 -0.097098 -0.0340612 0.1011592 -0.0356392 -0.0767562 0.0830104 -0.0041254 0.0022004 0.0052836 -0.1480109 0.0450082 -0.0111328 0.0960443 0.0165228 -0.0414312 -0.0481708 -0.1163083 -0.014686 0.001319 -0.0045555 -0.1251167 -0.0831675 -0.071225 0.072455 0.0158313 0.0015071 0.0444841 0.0113819 -0.0687891 0.0665715 -0.095433 -0.1464087 -0.1283297 0.109109 -0.0574646 0.1374214 -0.0760058 -0.0099318 -0.1277512 0.0758804 0.0210374 -0.031645 -0.0200735 0.0387699 -0.0088001 -0.0499025 0.1879217 0.0275763 0.0894378 -0.0247095 0.0209811 -0.0028982 -0.0465971 0.0616247 0.0282272 -0.1082881 -0.0023545 -0.0227904 0.0621529 0.2086314 -0.033507 0.0963213 -0.0006209 0.1490425 -0.0701609 0.0325648 -0.0772384 0.3284445 0.0972202 0.0401626 -0.0686651 0.0167126 -0.0117105 0.1164215 -0.0449939 0.1262507 0.0286778 0.0677191 -0.1034742 -0.0083442 -0.1022982 0.0378882 0.0282885 0.0000793 0.0165435 0.1101261 -0.0171852 -0.1206451 -0.0094812 -0.1375653 -0.0150445 0.0410184 -0.0157141 0.0432457 0.1219071 0.077741 0.010458 -0.0469401 0.0283622 -0.0201471 0.1255231 -0.0608156 0.123377 0.0407054 -0.0668687 -0.0120089 -0.1212525 -0.0138046 0.1072687 0.0298799 -0.1307063 0.0300237 0.0668379 unknown
polarizability: 140.5003798|11.696424|114.1762837|7.070171|-8.8673493|92.5269781 unknown
InChI: InChI=1S/C10H12N2O/c13-10-11-6-7-12(10)8-9-4-2-1-3-5-9/h1-5,11H,6-8H2
charge 0 multiplicity 1
25 atoms
O  -2.075052 -2.018519 -0.820267
N  -1.448594 0.277805 -0.651703
N  -3.100994 -0.470613 0.679715
C  -1.714538 1.389114 0.281163
C  -3.090225 0.985785 0.900009
C  -0.243543 0.189732 -1.484065
C  -2.199534 -0.864561 -0.318901
C  1.059366 0.162493 -0.682566
C  2.01534 1.19925 -0.809483
C  1.323901 -0.911786 0.207198
C  3.217564 1.16845 -0.063887
C  2.521114 -0.943663 0.954496
C  3.472401 0.096848 0.821395
H  -1.767033 2.358859 -0.245012
H  -0.925075 1.453568 1.058226
H  -3.147271 1.245149 1.971019
H  -3.924806 1.487363 0.36816
H  -0.231409 1.037153 -2.196489
H  -0.355337 -0.74476 -2.065892
H  -3.867916 -1.083241 0.9462
H  1.821408 2.032211 -1.497698
H  0.591584 -1.723161 0.30014
H  3.950709 1.975733 -0.173783
H  2.717503 -1.780903 1.63387
H  4.403037 0.069596 1.399455
