program: Gaussian 09
title: 000231400
version: EM64L-G09RevD.01
frameworkgroup: C1[X(C14H12O3)]
method: RPBEPBE
basis: SDD
operation: Freq
keyword: #pfreq=noraman
keyword: PBEPBE/SDD
title: #p freq=noraman PBEPBE/SDD
converged: YES YES NO NO
title: Mulliken charges:
elementType: O O O C C C C C C C C C C C C C C H H H H H H H H H H H H
charge: -0.452376 -0.405521 -0.245216 -0.443612 0.327552 0.479068 0.126646 -0.346584 0.161342 -0.416748 -0.352322 -0.389536 -0.265042 -0.225535 -0.231744 -0.212340 -0.244166 0.286371 0.279124 0.238186 0.248371 0.216055 0.228201 0.224465 0.224564 0.227878 0.227253 0.359761 0.375903
chargesum: 0.00000
title: Mulliken charges with hydrogens summed into heavy atoms:
elementType: O O O C C C C C C C C C C C C C C
charge: -0.092614 -0.029619 -0.245216 -0.157241 0.327552 0.479068 0.126646 -0.067460 0.161342 -0.178562 -0.103950 -0.173481 -0.036841 -0.001070 -0.007180 0.015538 -0.016913
polarizability: 1.73835900e+02 -4.89483006e+00 1.32119345e+02 1.07346721e+01 -1.39092108e+01 1.52002051e+02
1716.lowfreq: -11.1696 -6.0586 0.0003 0.0005 0.0005 6.2421 18.2264 36.2449 42.2311
frequency: 16.3956 36.2406 42.1724 55.3312 109.9618 143.0879 171.9365 210.8275 237.0753 283.9144 291.9088 332.0830 346.3172 401.6934 434.6680 454.5448 491.7131 512.2598 533.1758 551.5567 594.8697 613.6362 631.5060 656.3864 698.9737 709.4805 730.6123 757.1095 761.4467 800.9801 820.6500 847.0929 850.6648 859.8431 905.1507 935.5665 949.4837 972.2199 987.9069 991.3067 993.6424 1027.3871 1042.5235 1053.3951 1069.3212 1084.2732 1155.2190 1170.2413 1171.5867 1178.7560 1188.3326 1191.9423 1235.5062 1243.7765 1260.7653 1312.2927 1340.7243 1362.6941 1386.6644 1394.0870 1438.9756 1443.5578 1479.5530 1492.2974 1594.5757 1600.8439 1607.2832 1613.3903 1654.1018 3078.5946 3111.8409 3122.5515 3131.2534 3137.6930 3143.8380 3152.3764 3153.4346 3165.2081 3168.5528 3499.0966 3588.4905
redmass: 3.9749 6.9613 5.3531 5.3202 6.6252 6.0470 5.1308 5.0005 5.3146 4.6949 5.3821 5.9902 1.1957 2.7931 4.1671 3.3689 3.4742 4.9841 4.4982 4.2384 3.8768 5.8893 1.6731 5.0317 1.9375 3.0259 3.1486 1.4348 2.2070 5.3302 3.5136 1.2728 1.7634 3.3472 2.1061 2.2748 1.4732 1.4010 1.4016 4.7849 1.3208 2.2805 2.2438 2.3963 2.4503 1.6460 1.2493 1.3264 1.0870 1.8898 1.9237 1.1144 1.5490 2.3986 1.5897 1.5460 1.2757 1.7642 5.6500 5.4172 2.3334 2.1098 2.2087 2.5350 6.0673 6.3423 6.0996 6.4900 7.9484 1.0842 1.0886 1.0845 1.0879 1.0880 1.0927 1.0944 1.0950 1.1012 1.1000 1.0637 1.0660
irintensity: 0.2618 3.2692 0.2649 0.8297 0.4881 1.9769 0.9005 0.5595 2.6309 8.7525 2.9127 3.3356 115.1053 0.1080 10.0542 2.6567 2.5028 2.5968 17.5525 9.7629 72.1726 2.7971 132.2697 9.8434 59.8632 20.2969 14.9191 92.8318 34.6391 15.6659 7.9794 0.0946 2.2639 1.3278 10.7452 10.0034 1.2287 0.0993 0.1727 2.0821 0.0221 7.9638 7.6937 327.3158 62.0652 31.4626 55.2443 13.9109 3.3079 0.5634 18.0003 1.6365 1.3214 24.7507 11.9505 32.3172 6.4557 53.5703 5.9237 16.5605 34.6073 9.7800 25.1898 39.1808 1.3732 13.6204 6.9497 7.7517 141.7987 2.0779 12.3498 0.8802 4.8125 10.2285 26.4438 20.7362 13.1573 18.9199 20.7188 23.3121 29.5380
temp: 298.150 k
press: 1.00000 atm
elementType: 8 8 8 6 6 6 6 6 6 6 6 6 6 6 6 6 6 1 1 1 1 1 1 1 1 1 1 1 1
symmnumber: 1
zpe: 586005.0 jmol-1
zpe.correction: 0.223198 hartree
zpe.thermalcorrener: 0.237924 hartree
zpe.thermalcorrenthalpy: 0.238868 hartree
zpe.thermalcorrgfe: 0.179209 hartree
zpe.sumelectzpe: -765.166113 hartree
zpe.sumelectthermal: -765.151387 hartree
zpe.sumelectthermalent: -765.150442 hartree
zpe.sumelectthermalfe: -765.210102 hartree
dipole: -1.1136 -1.7490 1.3594
dipole: 2.4793
quadrupole: -89.0156 -90.0737 -92.2410
quadrupole: 4.0043 -1.2579 -2.1526
quadrupole: 1.4278 0.3698 -1.7976 4.0043 -1.2579 -2.1526
hfenergy: -765.3893109 hartree
pointgroup: C01 [X(C14H12O3)]
dipole: 0.5109727 -0.5654982 -0.6087654 debye
polarizability: 170.811659|1.0452702|127.263655|13.3248239|8.7231424|159.8819821 unknown
InChI: InChI=1S/C14H12O3/c15-12-9-5-4-8-11(12)13(14(16)17)10-6-2-1-3-7-10/h1-9,13,15-16H
charge 0 multiplicity 1
29 atoms
O  1.436719 -0.823237 -2.095094
O  -0.393724 3.213532 -0.878449
O  -0.414752 2.546217 1.337864
C  -0.06451 0.862543 -0.475099
C  1.180683 0.16544 0.090018
C  -1.337484 0.005119 -0.294983
C  1.904058 -0.706723 -0.769046
C  1.628084 0.299054 1.42565
C  -0.293527 2.244696 0.128666
C  -2.011736 -0.489549 -1.437568
C  -1.836547 -0.30733 0.994507
C  3.036573 -1.418336 -0.312754
C  2.759833 -0.407183 1.894521
C  -3.169051 -1.288846 -1.295932
C  -2.994417 -1.10282 1.135236
C  3.463704 -1.268447 1.024617
C  -3.664333 -1.597538 -0.008594
H  0.089155 1.006849 -1.555424
H  1.088122 0.974077 2.09708
H  -1.621936 -0.257495 -2.435083
H  -1.326087 0.077621 1.883789
H  3.579967 -2.085279 -0.99537
H  3.087238 -0.283607 2.931921
H  -3.681179 -1.668555 -2.187328
H  -3.374498 -1.336716 2.136173
H  4.340697 -1.821047 1.378698
H  -4.56223 -2.215897 0.102893
H  2.003626 -1.446506 -2.612508
H  -0.57895 4.099264 -0.460498
