program: Gaussian 09
title: 000231396
version: EM64L-G09RevD.01
frameworkgroup: C1[X(C13H20O3)]
method: RPBEPBE
basis: SDD
operation: Freq
keyword: #pfreq=noraman
keyword: PBEPBE/SDD
title: #p freq=noraman PBEPBE/SDD
converged: YES YES NO NO
title: Mulliken charges:
elementType: O O O C C C C C C C C C C C C C H H H H H H H H H H H H H H H H H H H H
charge: -0.270796 -0.262539 -0.270646 -0.025919 -0.313450 0.236993 0.301615 -0.229203 -0.205780 -0.347193 -0.385534 -0.787123 -0.245633 -0.682137 -0.682889 -0.246800 0.219178 0.211956 0.228807 0.223510 0.192144 0.211647 0.199750 0.244719 0.230565 0.212019 0.241599 0.235195 0.222804 0.204826 0.228263 0.224785 0.205211 0.231815 0.223764 0.224477
chargesum: 0.00000
title: Mulliken charges with hydrogens summed into heavy atoms:
elementType: O O O C C C C C C C C C C C C C
charge: -0.270796 -0.262539 -0.270646 0.193259 0.127314 0.236993 0.301615 0.186451 0.205617 -0.102474 -0.154969 -0.098311 -0.022829 -0.024263 -0.022100 -0.022323
polarizability: 1.94360753e+02 -2.24130692e-01 1.58474117e+02 -5.73567103e+00 -1.62043943e+01 1.05146457e+02
1716.lowfreq: -7.0553 -0.0008 -0.0007 -0.0007 3.9243 5.9375 24.5011 31.1043 45.8299
frequency: 24.2501 30.9962 45.7572 52.9751 68.5869 85.7193 109.3184 132.0547 138.2060 175.2042 183.4412 208.7654 209.5097 237.3085 250.9060 259.3015 270.9394 325.1924 351.5356 432.0923 444.3634 450.4719 515.5400 541.2573 544.1762 594.6614 654.6447 717.3119 746.4012 753.8983 795.9582 798.0578 813.8731 820.2284 825.4353 845.4946 920.5193 926.3634 969.7527 978.4507 986.2429 994.5829 1025.1246 1046.0260 1048.1521 1048.9203 1062.2783 1095.6497 1111.7920 1118.3693 1132.4435 1137.4680 1141.9521 1171.4849 1192.0891 1222.5340 1234.6041 1250.2597 1256.7224 1286.4212 1305.9237 1319.6943 1365.4248 1366.5452 1379.6437 1391.1344 1395.1759 1398.9847 1401.8482 1429.2358 1457.5026 1458.2400 1459.9238 1460.9444 1477.9681 1478.6630 1481.6048 1489.6916 1492.3942 1496.3106 1597.3544 1608.7524 2950.3353 2952.5929 2969.6091 2981.3315 2992.1680 2993.2459 3011.3462 3015.7520 3023.0333 3040.3229 3059.6249 3089.1930 3089.9192 3090.3670 3099.5937 3100.8510 3121.9002 3132.9583 3154.1345 3167.7449
redmass: 3.6116 4.2224 3.0166 3.6779 1.9388 2.0790 2.4598 2.8735 1.2035 3.4248 2.7580 2.5265 3.6217 1.2743 1.5092 2.9042 3.9847 3.0726 3.8484 2.9564 2.9242 3.7573 5.7010 3.6843 3.9190 5.6272 5.2258 2.3390 4.7553 1.5098 3.2882 2.2810 1.1913 1.4730 2.0523 1.3640 2.4013 1.5625 1.3219 3.8966 1.5553 6.0817 2.6030 2.6576 1.5373 2.1422 2.8030 2.7115 2.1256 1.8736 1.9905 1.4373 1.5784 1.1004 2.4952 1.1709 2.9368 1.1519 1.1515 1.4446 1.2470 1.1571 1.2779 1.4967 1.7047 2.0769 1.2595 1.3975 1.3789 1.9860 1.1271 1.0639 1.0422 1.0411 1.1841 1.0847 1.0457 2.1892 1.0823 1.0864 6.8173 6.2592 1.0601 1.0582 1.0550 1.0364 1.0360 1.0361 1.0880 1.1027 1.1020 1.1064 1.0968 1.0988 1.1003 1.0989 1.1012 1.1012 1.0865 1.0891 1.0934 1.0991
irintensity: 0.0406 0.1765 0.2086 0.1742 0.8260 2.1745 0.9831 3.1382 0.9245 1.5293 12.4512 1.5219 0.0519 0.1052 3.4921 5.5902 1.9427 3.9895 10.8622 1.0938 3.8274 0.4055 3.6621 4.4181 8.6069 7.4855 0.3129 9.7817 8.6063 76.8503 2.5830 28.2014 7.6966 7.7074 2.9946 1.2627 81.5782 38.6256 2.3823 164.5762 5.3998 44.6396 108.5842 56.1273 8.0404 3.8745 93.3628 48.0175 16.6523 51.1983 30.9726 5.8296 2.5423 6.7419 68.2242 11.8932 128.6065 0.9912 0.3409 0.0231 16.2627 17.7888 3.0003 2.6866 3.4178 6.1858 23.4423 17.1178 14.4288 29.5564 37.3618 20.2913 7.5101 9.8183 12.1521 4.0869 3.0029 78.5387 10.3830 1.6212 12.4921 36.8394 50.9364 51.7897 41.1323 27.3271 28.2381 24.1348 42.3122 18.3157 28.5378 35.5246 18.7293 30.4986 23.8773 38.9117 38.0412 40.8700 8.0324 13.9747 39.7051 14.8078
temp: 298.150 k
press: 1.00000 atm
elementType: 8 8 8 6 6 6 6 6 6 6 6 6 6 6 6 6 1 1 1 1 1 1 1 1 1 1 1 1 1 1 1 1 1 1 1 1
symmnumber: 1
zpe: 798872.3 jmol-1
zpe.correction: 0.304274 hartree
zpe.thermalcorrener: 0.322353 hartree
zpe.thermalcorrenthalpy: 0.323298 hartree
zpe.thermalcorrgfe: 0.256201 hartree
zpe.sumelectzpe: -731.769613 hartree
zpe.sumelectthermal: -731.751534 hartree
zpe.sumelectthermalent: -731.750590 hartree
zpe.sumelectthermalfe: -731.817687 hartree
dipole: 1.4691 -0.3522 0.5771
dipole: 1.6172
quadrupole: -89.3354 -87.6304 -101.2643
quadrupole: 0.5011 2.5371 -5.6699
quadrupole: 3.4080 5.1129 -8.5209 0.5011 2.5371 -5.6699
hfenergy: -732.0738877 hartree
pointgroup: C01 [X(C13H20O3)]
dipole: -0.5467474 -0.0432956 0.3225461 debye
polarizability: 187.5575431|-23.596173|107.4003025|-2.9726065|7.6302903|163.0234815 unknown
InChI: InChI=1S/C13H20O3/c1-4-14-13(15-5-2)10-16-12-9-7-6-8-11(12)3/h6-9,13H,4-5,10H2,1-3H3
charge 0 multiplicity 1
36 atoms
O  0.590487 0.327605 -0.446489
O  -2.343204 1.896393 1.128426
O  -2.354354 -0.114961 -0.219515
C  -1.609398 1.065702 0.17115
C  -0.262596 0.580473 0.718341
C  1.894704 -0.149042 -0.209396
C  2.662597 -0.401351 -1.384648
C  -2.688464 1.221991 2.404147
C  -3.495682 0.175804 -1.117746
C  2.431827 -0.367062 1.081514
C  3.982075 -0.876535 -1.216762
C  2.058561 -0.16089 -2.75272
C  3.757132 -0.843322 1.213843
C  -3.71202 2.107708 3.112579
C  -4.20563 -1.148201 -1.391888
C  4.537117 -1.099142 0.067333
H  -1.450449 1.746243 -0.688503
H  0.18453 1.371358 1.353702
H  -0.398738 -0.347558 1.307741
H  -3.098913 0.216673 2.186228
H  -1.774391 1.106193 3.024506
H  -4.170096 0.908532 -0.631256
H  -3.106749 0.625456 -2.0561
H  1.837597 -0.172747 1.979325
H  4.584162 -1.076656 -2.111384
H  2.766929 -0.438959 -3.551722
H  1.12871 -0.743993 -2.883928
H  1.779561 0.901097 -2.88473
H  4.171742 -1.011475 2.214099
H  -3.989378 1.670936 4.089623
H  -3.299554 3.116948 3.284944
H  -4.625507 2.209241 2.501409
H  -5.0587 -0.991535 -2.077134
H  -3.511892 -1.870854 -1.854803
H  -4.586817 -1.587609 -0.453747
H  5.5634 -1.468264 0.166164
