program: Gaussian 09
title: 000021900
version: EM64L-G09RevD.01
frameworkgroup: C1[X(C11H20O3)]
method: RPBEPBE
basis: SDD
operation: Freq
keyword: #pfreq=noraman
keyword: PBEPBE/SDD
title: #p freq=noraman PBEPBE/SDD
converged: NO YES NO NO
title: Mulliken charges:
elementType: O O O C C C C C C C C C C C H H H H H H H H H H H H H H H H H H H H
charge: -0.280749 -0.281000 -0.449519 0.024549 0.276585 -0.455972 -0.459609 -0.407004 -0.407048 -0.385139 -0.005376 -0.773943 -0.342237 -0.373743 0.201613 0.189884 0.237742 0.236420 0.186494 0.197822 0.194533 0.193375 0.197769 0.196798 0.188071 0.235212 0.230354 0.233643 0.232162 0.193359 0.225119 0.210882 0.191729 0.347225
chargesum: 0.00000
title: Mulliken charges with hydrogens summed into heavy atoms:
elementType: O O O C C C C C C C C C C C
charge: -0.280749 -0.281000 -0.102293 0.226162 0.276585 -0.028347 -0.036694 -0.014648 -0.015904 -0.000271 0.229836 -0.077784 0.076240 0.028868
polarizability: 1.45162895e+02 -1.86556541e-01 1.17888754e+02 1.63357025e+00 1.63956370e+00 1.09276489e+02
1716.lowfreq: -30.1292 -17.8856 0.0003 0.0006 0.0006 4.9259 29.6898 45.4753 65.4085
frequency: 29.0712 45.1219 64.9350 99.4783 116.9303 160.5694 164.7195 183.4945 219.9970 230.8672 245.9252 271.0287 320.5446 338.3476 369.6184 405.8550 431.2774 443.9806 463.8656 489.5812 525.9423 608.0587 674.1252 730.3108 782.4638 792.3038 799.9078 836.7104 859.6475 887.0597 894.0812 916.0591 921.6643 938.1005 958.9433 991.0028 1007.6452 1040.4537 1046.0480 1055.8611 1060.5976 1067.4253 1084.4892 1100.1691 1103.9843 1108.5192 1158.5879 1173.4430 1186.2991 1217.4817 1221.7075 1233.9275 1252.9339 1259.6102 1271.0463 1275.8109 1298.0750 1319.4467 1324.3737 1328.7234 1331.7323 1339.9126 1344.4372 1347.6831 1362.6524 1386.9525 1417.6254 1458.3812 1459.2666 1460.6015 1461.7777 1462.9688 1468.4805 1472.4476 1474.9969 1481.3629 2937.0436 2950.8365 2960.5654 2963.4417 2963.9905 2965.7255 2967.1555 2974.3294 2991.9486 3004.6992 3013.0030 3024.6438 3026.0225 3035.9012 3046.8746 3053.1436 3071.4480 3105.1744 3110.0623 3582.0198
redmass: 3.5849 3.5083 3.2386 3.5086 2.8538 1.3498 2.4889 1.0865 2.2511 1.9662 2.7055 3.8388 2.9844 1.9255 4.1314 3.1941 3.0775 2.5052 2.7129 3.0343 2.0512 3.0547 4.7518 3.6467 2.7193 1.4596 2.7128 2.3322 2.6680 2.1639 1.5365 1.8316 1.9931 1.8320 6.5373 4.5224 2.4173 2.6572 1.8387 1.1931 1.5789 1.6323 1.9244 2.1778 2.0660 2.1970 1.7191 1.5397 1.5002 1.1991 2.4217 1.1834 1.4665 1.3036 1.4813 1.3298 1.2678 1.2771 1.2400 1.4255 1.3732 1.4585 1.4266 1.3816 1.4696 1.2954 1.5845 1.0763 1.0670 1.0743 1.0710 1.0849 1.0801 1.0839 1.0890 1.0925 1.0595 1.0799 1.0676 1.0605 1.0651 1.0663 1.0609 1.0655 1.0855 1.0357 1.0996 1.0962 1.0980 1.1009 1.0986 1.0999 1.0985 1.0994 1.1000 1.0668
irintensity: 3.8700 1.0719 4.4378 0.6244 2.0980 125.4496 33.4627 0.6722 7.2309 0.9277 5.5681 1.6728 0.7982 0.3888 2.3805 8.2064 0.0161 1.9305 3.8225 7.3910 9.3231 21.2260 2.5156 10.2223 30.4720 0.7120 5.2758 11.4871 22.2758 8.6806 9.1405 0.0264 1.0017 15.7911 96.5327 73.9311 11.8996 20.6485 1.6593 2.5511 12.3192 11.3814 36.0525 36.2451 33.4684 2.4331 28.9356 19.0060 3.6431 10.3223 59.0184 24.7280 7.1485 1.1019 1.4933 11.7001 1.9689 29.4218 0.9065 0.3023 0.3112 0.8159 1.7586 3.3336 2.0535 43.8759 1.3589 15.3799 1.5475 7.5252 3.8160 7.6459 1.6766 21.9576 3.4323 3.8403 44.0208 8.9961 109.0838 35.5830 40.8779 17.1804 6.8734 58.9250 17.2843 11.2806 52.9651 73.2422 64.1049 59.7930 27.2389 66.2040 37.9844 19.9397 24.1266 4.7600
temp: 298.150 k
press: 1.00000 atm
elementType: 8 8 8 6 6 6 6 6 6 6 6 6 6 6 1 1 1 1 1 1 1 1 1 1 1 1 1 1 1 1 1 1 1 1
symmnumber: 1
zpe: 776900.1 jmol-1
zpe.correction: 0.295906 hartree
zpe.thermalcorrener: 0.310869 hartree
zpe.thermalcorrenthalpy: 0.311813 hartree
zpe.thermalcorrgfe: 0.253479 hartree
zpe.sumelectzpe: -655.675411 hartree
zpe.sumelectthermal: -655.660448 hartree
zpe.sumelectthermalent: -655.659504 hartree
zpe.sumelectthermalfe: -655.717838 hartree
dipole: -2.1379 -0.2976 0.0405
dipole: 2.1589
quadrupole: -68.4408 -91.4857 -84.9203
quadrupole: 0.3464 0.4643 -0.0821
quadrupole: 13.1748 -9.8701 -3.3047 0.3464 0.4643 -0.0821
hfenergy: -655.9713171 hartree
pointgroup: C01 [X(C11H20O3)]
dipole: 0.84254 0.1029976 0.0309656 debye
polarizability: 145.1361563|-0.1766846|118.1909191|-1.9056917|0.0438881|109.0010625 unknown
InChI: InChI=1S/C11H20O3/c1-11(9-5-3-2-4-6-9)13-8-10(7-12)14-11/h9-10,12H,2-8H2,1H3
charge 0 multiplicity 1
34 atoms
O  1.408669 -0.303325 0.691321
O  0.804974 1.827632 -0.168595
O  3.568884 -2.050036 -0.616382
C  -0.944957 0.102592 -0.009718
C  0.30817 0.691113 0.684882
C  -1.488061 -1.157759 0.711778
C  -2.075486 1.14445 -0.20742
C  -2.657348 -1.780851 -0.087193
C  -3.251191 0.529702 -1.005098
C  -3.789572 -0.752096 -0.323509
C  2.225153 -0.052192 -0.519666
C  0.127104 1.176146 2.121948
C  2.16172 1.486163 -0.630763
C  3.62313 -0.614633 -0.31001
H  -0.606431 -0.210936 -1.021634
H  -1.854421 -0.880913 1.722201
H  -0.671284 -1.891003 0.846218
H  -1.674649 2.035413 -0.724649
H  -2.451969 1.477721 0.781763
H  -3.051251 -2.667467 0.446921
H  -2.278486 -2.139737 -1.066826
H  -2.90492 0.279943 -2.029765
H  -4.063743 1.27429 -1.115533
H  -4.595623 -1.201636 -0.935845
H  -4.241535 -0.480414 0.65345
H  1.764577 -0.537662 -1.403569
H  -0.662706 1.943434 2.175589
H  -0.14286 0.33639 2.784363
H  1.071453 1.616877 2.480882
H  2.922494 1.96449 0.021498
H  2.268929 1.856409 -1.664113
H  3.927817 -0.421418 0.738872
H  4.33222 -0.101609 -0.996782
H  4.3683 -2.501079 -0.247615
