program: Gaussian 09
title: 000231387
version: EM64L-G09RevD.01
frameworkgroup: C1[X(C9H16N2O)]
method: RPBEPBE
basis: SDD
operation: Freq
keyword: #p
keyword: freq=noraman
keyword: PBEPBE/SDD
title: #p freq=noraman PBEPBE/SDD
converged: YES YES NO NO
title: Mulliken charges:
elementType: O N N C C C C C C C C C H H H H H H H H H H H H H H H H
charge: -0.316894 -0.141690 -0.651924 -0.526861 -0.574632 0.559794 0.572494 0.266986 -0.794342 -0.811878 -0.744586 -0.730641 0.228143 0.265510 0.252849 0.216924 0.220202 0.231376 0.244463 0.251400 0.205885 0.236716 0.218527 0.222701 0.224674 0.224759 0.312863 0.337182
chargesum: 0.00000
title: Mulliken charges with hydrogens summed into heavy atoms:
elementType: O N N C C C C C C C C C
charge: -0.316894 -0.141690 -0.001879 -0.033208 -0.104859 0.559794 0.572494 0.266986 -0.098302 -0.117877 -0.303358 -0.281208
polarizability: 1.12642987e+02 2.69075628e+00 1.47342747e+02 3.47365253e-01 1.48076705e+00 8.07968078e+01
1716.lowfreq: -13.9804 -5.1342 0.0002 0.0004 0.0006 7.6628 32.4797 45.9980 49.7554
frequency: 30.0792 45.8451 49.5018 68.3925 92.3335 103.5570 155.4401 169.9418 187.0440 250.7033 307.4199 319.6244 379.2270 399.7754 400.3234 412.9536 445.4788 469.0885 493.4740 517.6613 564.1310 624.5893 680.7539 710.7078 722.7401 792.7502 817.4193 820.3187 930.1698 935.5654 947.0780 956.1402 968.7638 971.6521 1015.3606 1025.9437 1037.1426 1047.5740 1051.8050 1118.2136 1157.2485 1258.8581 1276.6330 1296.4499 1303.8384 1337.7678 1351.7500 1394.6343 1396.2625 1417.1290 1428.6541 1444.7481 1447.4687 1458.3422 1464.0823 1472.6182 1475.7166 1482.3984 1577.9534 1630.5314 1667.9602 1670.6360 2959.1435 2973.3400 2981.5084 2994.6428 3034.9239 3039.0044 3049.3422 3061.1229 3083.5757 3088.0952 3091.3099 3091.8330 3187.0014 3191.7372 3549.2878 3699.9084
redmass: 3.0537 3.2107 3.0174 4.8528 3.7136 3.0354 1.1547 2.9743 1.0466 3.8113 3.3781 3.8461 1.4009 2.2780 2.0211 2.2510 2.0820 2.2938 2.4179 1.1593 3.1073 2.1829 1.2773 7.5829 1.3690 2.3740 3.5390 3.2565 1.4912 1.7126 1.4080 1.3605 1.6228 1.5691 1.6806 1.5534 1.7779 1.5530 1.5733 1.9183 2.7841 1.8042 2.3085 2.5615 1.9477 1.2296 1.2907 1.2261 1.2290 1.6446 1.1976 1.2955 1.2789 1.0676 1.0533 1.0710 1.0828 1.1550 2.1993 1.8277 4.9415 4.9877 1.0415 1.0371 1.0592 1.0598 1.1015 1.0929 1.0956 1.1019 1.0627 1.0631 1.1000 1.0980 1.1139 1.1141 1.0448 1.1039
irintensity: 0.1446 0.1997 0.3778 7.2247 5.8509 3.2455 0.4493 1.8308 1.0811 11.0138 9.0446 4.0103 109.9513 0.6187 10.0779 20.1389 16.8907 4.3174 40.0317 105.4935 10.3227 11.9949 0.5362 28.3575 3.3052 0.6077 2.0492 6.1283 8.1943 18.5832 109.8443 32.9778 5.9521 4.8207 34.8791 1.7153 13.6929 11.7763 15.9135 1.7278 21.4829 4.4061 61.1287 4.6148 74.6091 12.1166 11.4616 30.2089 20.2521 129.7468 10.6671 45.6233 47.3580 45.7337 20.4643 20.5828 12.6706 62.8150 277.5177 235.7298 30.9727 17.9486 28.2608 18.2920 33.7803 24.9081 11.3916 23.4822 19.9925 7.1980 8.9062 9.2453 30.2319 19.9273 30.1608 17.6612 29.0649 40.1589
temp: 298.150 k
press: 1.00000 atm
elementType: 8 7 7 6 6 6 6 6 6 6 6 6 1 1 1 1 1 1 1 1 1 1 1 1 1 1 1 1
symmnumber: 1
zpe: 625193.2 jmol-1
zpe.correction: 0.238124 hartree
zpe.thermalcorrener: 0.252611 hartree
zpe.thermalcorrenthalpy: 0.253555 hartree
zpe.thermalcorrgfe: 0.195770 hartree
zpe.sumelectzpe: -536.316035 hartree
zpe.sumelectthermal: -536.301548 hartree
zpe.sumelectthermalent: -536.300604 hartree
zpe.sumelectthermalfe: -536.358389 hartree
dipole: 3.0848 -1.5243 2.0054
dipole: 3.9826
quadrupole: -69.5538 -76.2092 -75.2390
quadrupole: 7.6325 -1.7013 6.2057
quadrupole: 4.1135 -2.5419 -1.5717 7.6325 -1.7013 6.2057
hfenergy: -536.554159 hartree
pointgroup: C01 [X(C9H16N2O1)]
dipole: -1.2429355 -0.5028242 -0.8107962 debye
polarizability: 112.4426572|-0.6180837|147.5699123|0.4089928|0.4698914|80.7699724 unknown
InChI: InChI=1S/C9H16N2O/c1-7(2)5-11(9(10)12)6-8(3)4/h1,3,5-6,10H2,2,4H3
charge 0 multiplicity 1
28 atoms
O  0.934904 2.522352 0.838257
N  0.005563 0.518457 0.052358
N  -0.895993 2.635227 -0.583187
C  0.928134 -0.272968 0.903445
C  -0.846067 -0.248071 -0.883085
C  2.056431 -0.933399 0.112696
C  -2.04784 -0.920015 -0.211975
C  0.058899 1.91425 0.141631
C  2.955069 0.001074 -0.673214
C  -3.030077 -0.008359 0.498413
C  2.233575 -2.281378 0.14782
C  -2.197662 -2.269716 -0.261902
H  0.344255 -1.04204 1.443784
H  1.351493 0.435506 1.638518
H  -0.217501 -1.026895 -1.355689
H  -1.17839 0.420557 -1.700725
H  3.777826 -0.542657 -1.167729
H  2.379201 0.543543 -1.447944
H  3.381491 0.778539 -0.01158
H  -2.513727 0.6119 1.255309
H  -3.519629 0.688106 -0.213328
H  -3.824536 -0.582301 1.003829
H  1.564358 -2.932774 0.724076
H  3.062156 -2.767725 -0.380236
H  -1.465225 -2.90873 -0.770556
H  -3.056183 -2.772535 0.198388
H  -1.738885 2.230728 -0.981067
H  -0.816538 3.647223 -0.520708
