program: Gaussian 09
title: 000231386
version: EM64L-G09RevD.01
frameworkgroup: C1[X(C15H18N2O2)]
method: RPBEPBE
basis: SDD
operation: Freq
keyword: #p
keyword: freq=noraman
keyword: PBEPBE/SDD
title: #p freq=noraman PBEPBE/SDD
converged: NO YES NO NO
title: Mulliken charges:
elementType: O O N N C C C C C C C C C C C C C C C H H H H H H H H H H H H H H H H H H
charge: -0.201810 -0.202967 -0.285250 -0.217852 -0.049157 -0.416253 -0.463219 -0.412910 -0.371848 -0.454669 -0.347657 0.082136 0.082115 0.176228 0.182376 -0.355577 -0.356247 -0.212398 -0.212393 0.204307 0.201483 0.192243 0.227353 0.224868 0.196546 0.214482 0.194334 0.195234 0.244219 0.220560 0.203794 0.231729 0.272697 0.269112 0.268915 0.237803 0.237674
chargesum: 0.00000
title: Mulliken charges with hydrogens summed into heavy atoms:
elementType: O O N N C C C C C C C C C C C C C C C
charge: -0.201810 -0.202967 -0.041031 -0.217852 0.155150 -0.022527 -0.010997 -0.001882 0.017720 -0.030315 0.156769 0.082136 0.082115 0.176228 0.182376 -0.086465 -0.087333 0.025404 0.025281
polarizability: 2.50314582e+02 2.00206073e+00 1.79285147e+02 1.76303094e+01 -5.92322679e+00 1.12525235e+02
1716.lowfreq: -9.3122 -0.0007 -0.0003 0.0007 5.4546 8.8670 22.6166 30.7362 33.3009
frequency: 20.7154 29.3760 32.8299 85.1967 101.4853 133.7479 137.5272 171.1154 181.3292 230.3009 236.7897 263.3807 272.6962 320.3741 334.9042 375.6421 414.8411 432.7444 444.8648 456.4319 469.1457 520.0122 523.3887 570.1254 612.9162 659.0623 671.4620 678.6756 699.3898 716.1610 769.4279 784.8340 794.6393 799.6276 832.2157 845.3552 862.7039 892.2336 905.3393 917.2555 948.6887 956.2441 972.8115 976.7524 1004.8944 1013.5381 1030.6266 1044.0286 1068.4929 1072.4604 1081.5605 1101.2583 1112.9016 1131.9999 1166.8787 1169.0331 1171.7983 1201.4265 1203.2481 1234.6178 1248.2913 1276.6001 1282.6817 1292.9085 1307.6027 1321.3754 1329.6841 1334.8231 1338.7492 1343.7157 1344.5744 1354.0947 1372.5913 1416.0909 1438.5475 1450.2066 1452.9422 1453.7513 1458.1098 1460.0384 1463.5283 1468.2892 1474.1948 1615.1199 1617.0157 1625.8663 1674.9003 2942.0113 2957.2184 2963.7901 2965.2091 2972.6743 2981.6639 3020.1458 3024.8315 3026.6979 3035.3187 3043.9289 3048.6164 3094.8869 3138.6220 3152.2424 3163.8829 3173.9407 3397.6058
redmass: 5.0338 3.8292 4.5612 3.6167 3.9838 6.4925 4.9992 2.6834 5.1364 3.9425 2.0423 3.1386 4.8232 1.7948 9.4903 3.3913 3.1727 3.6413 2.7941 4.8888 2.1254 2.8431 6.3214 3.2003 4.9228 4.7845 1.9330 4.6926 5.2854 3.0516 1.3630 5.0921 1.6705 1.8248 2.1228 3.4962 1.8388 1.8789 1.3909 2.5251 2.6042 3.1287 1.4142 1.9654 1.3453 2.1250 2.5023 2.1519 1.7211 2.6292 1.9325 2.5820 2.9167 1.5172 1.2206 2.0832 2.0004 2.0256 2.2936 1.5557 1.2334 1.2896 1.4782 1.3654 1.3168 1.2808 1.2807 1.4426 3.1807 1.5005 1.3791 1.3027 1.6264 5.9731 1.1386 1.3464 2.4594 1.6487 1.0922 1.1180 1.1742 1.0907 1.1103 7.7197 8.7044 10.2990 11.7371 1.0807 1.0617 1.0606 1.0653 1.0640 1.0612 1.0995 1.0594 1.0967 1.1016 1.1002 1.1027 1.1052 1.0863 1.0905 1.0956 1.1004 1.0737
irintensity: 0.6601 0.2706 1.3514 1.1462 2.0423 4.2247 0.0186 0.9662 0.9110 0.1769 3.6704 3.0384 2.6790 3.4987 15.2066 3.8643 1.0003 6.0577 1.9346 0.0076 17.4636 2.0632 8.3151 0.8483 16.8706 0.1158 109.0727 15.3116 14.9968 58.5306 8.1295 0.0488 36.7194 0.4569 19.9663 9.6835 17.3201 12.9645 0.0011 5.8613 7.3296 14.7136 2.1694 20.7284 0.0004 1.1239 14.7685 25.8661 10.5240 11.1940 10.5140 3.8537 11.4957 10.0746 12.5996 8.9380 9.8285 32.0501 4.0880 5.5089 7.9144 1.5594 0.2394 1.7281 8.8428 10.1252 1.2656 7.9680 224.5232 29.9989 34.5902 0.3645 52.4610 14.7117 16.4047 10.4646 10.8465 0.3320 5.0724 9.2456 29.6343 9.4981 10.4427 3.8867 185.5487 261.5258 38.1591 13.6545 38.9695 34.6212 35.0565 44.2831 22.5769 41.7348 15.8970 76.0235 60.5849 23.1211 71.2817 7.7958 1.7709 5.7641 6.6792 22.6197 1.4568
temp: 298.150 k
press: 1.00000 atm
elementType: 8 8 7 7 6 6 6 6 6 6 6 6 6 6 6 6 6 6 6 1 1 1 1 1 1 1 1 1 1 1 1 1 1 1 1 1 1
symmnumber: 1
zpe: 802593.2 jmol-1
zpe.correction: 0.305692 hartree
zpe.thermalcorrener: 0.322401 hartree
zpe.thermalcorrenthalpy: 0.323345 hartree
zpe.thermalcorrgfe: 0.259525 hartree
zpe.sumelectzpe: -840.977384 hartree
zpe.sumelectthermal: -840.960675 hartree
zpe.sumelectthermalent: -840.959731 hartree
zpe.sumelectthermalfe: -841.023551 hartree
dipole: 1.0248 -0.4010 1.7905
dipole: 2.1017
quadrupole: -80.2221 -120.4514 -114.8946
quadrupole: -2.8036 2.5143 -0.3518
quadrupole: 24.9672 -15.2620 -9.7052 -2.8036 2.5143 -0.3518
hfenergy: -841.2830759 hartree
pointgroup: C01 [X(C15H18N2O2)]
dipole: 0.4073524 0.1247707 -0.7086499 debye
polarizability: 250.4380216|-3.1798382|178.6923385|-16.9398333|-8.6674731|112.9946036 unknown
InChI: InChI=1S/C15H18N2O2/c18-14-12-6-1-2-7-13(12)15(19)17(14)10-8-11-5-3-4-9-16-11/h1-2,6-7,11,16H,3-5,8-10H2
charge 0 multiplicity 1
37 atoms
O  1.326066 -2.457312 0.792813
O  0.714876 2.160399 0.09105
N  -3.517584 0.785905 0.642023
N  0.684119 -0.178942 0.531261
C  -3.126491 -0.458556 -0.080178
C  -3.995601 -0.71666 -1.343703
C  -1.622439 -0.410669 -0.41949
C  -5.502527 -0.697355 -0.986539
C  -5.887302 0.614345 -0.25983
C  -4.966103 0.838301 0.969877
C  -0.745959 -0.318343 0.849721
C  1.609462 -1.263945 0.519652
C  1.302133 1.051393 0.166529
C  2.927205 -0.667344 0.123312
C  2.743765 0.721457 -0.08579
C  4.180894 -1.273617 -0.042541
C  3.809057 1.550733 -0.465705
C  5.266012 -0.443242 -0.428343
C  5.08299 0.947308 -0.636022
H  -3.305545 -1.2998 0.625675
H  -3.721004 -1.689506 -1.798243
H  -3.778263 0.069462 -2.097413
H  -1.420107 0.466951 -1.066315
H  -1.349983 -1.315162 -0.995711
H  -5.728474 -1.558622 -0.32339
H  -6.115154 -0.828432 -1.898836
H  -5.781695 1.47072 -0.95772
H  -6.947484 0.582946 0.060872
H  -3.227226 1.618127 0.103836
H  -5.179195 1.810178 1.452158
H  -5.168048 0.049058 1.722404
H  -0.854422 -1.234217 1.457472
H  -1.066404 0.548689 1.45184
H  4.310064 -2.347933 0.121955
H  3.655776 2.622899 -0.623426
H  6.26047 -0.880596 -0.567869
H  5.938921 1.56308 -0.932584
