program: Gaussian 09
title: 000231383
version: EM64L-G09RevD.01
frameworkgroup: C1[X(C7H12N2O5)]
method: RPBEPBE
basis: SDD
operation: Freq
keyword: #p
keyword: freq=noraman
keyword: PBEPBE/SDD
title: #p freq=noraman PBEPBE/SDD
converged: YES YES YES YES
title: Mulliken charges:
elementType: O O O O O N N C C C C C C C H H H H H H H H H H H H
charge: -0.316568 -0.316568 -0.150999 -0.199816 -0.199817 -0.472271 -0.472271 -0.219105 -0.219105 -0.671525 -0.671525 0.310990 0.325743 0.325743 0.234355 0.234355 0.234357 0.234352 0.217332 0.229591 0.229590 0.217332 0.229592 0.229590 0.328324 0.328324
chargesum: 0.00000
title: Mulliken charges with hydrogens summed into heavy atoms:
elementType: O O O O O N N C C C C C C C
charge: -0.316568 -0.316568 -0.150999 -0.199816 -0.199817 -0.143947 -0.143947 0.249604 0.249605 0.004988 0.004989 0.310990 0.325743 0.325743
polarizability: 1.68653591e+02 2.38809639e-05 1.10147790e+02 4.76518266e-03 -4.34929508e-03 6.58960881e+01
1716.lowfreq: -24.7912 -3.0210 -0.0012 -0.0010 -0.0007 3.2848 13.8421 41.0437 50.0944
frequency: -24.7866 41.0372 49.6844 50.4996 54.5199 76.9038 90.4299 120.2591 145.4089 172.0989 193.3545 244.9756 247.5427 247.7928 253.9274 316.9905 345.2207 391.2804 425.9921 535.2178 591.5363 668.2850 693.9371 710.0966 722.7815 741.0141 743.0133 801.7490 801.8321 817.7462 871.2500 919.6914 976.4123 1011.2442 1029.6223 1064.6172 1095.9707 1114.1852 1116.8573 1139.6832 1139.7259 1181.7009 1181.8631 1252.4239 1252.4604 1359.6594 1359.8770 1402.6176 1402.7184 1447.7354 1463.7999 1463.8111 1475.6456 1477.2268 1481.3924 1489.6165 1491.2524 1668.5889 1696.7171 1741.3682 2997.8253 2997.8674 3013.3172 3013.3815 3072.1711 3072.1854 3094.5733 3094.6204 3109.4323 3109.4770 3522.4145 3535.8083
redmass: 7.1621 4.4842 2.7204 2.4809 4.2782 5.4351 2.5805 4.5067 3.0544 3.3484 5.4682 5.6091 1.2374 1.2526 7.8805 5.7693 4.9292 4.2541 4.9541 1.2438 8.7251 1.5751 3.8850 9.3207 7.9453 5.2315 6.3342 1.0971 1.0976 3.7947 4.5539 5.7929 7.6655 2.5755 2.9145 8.6962 2.4840 2.2033 2.2742 1.4689 1.4689 2.5807 4.5291 1.1267 1.1267 1.3074 1.3385 1.2617 1.2599 1.9563 1.0403 1.0403 1.1543 1.0593 1.4363 1.0862 1.2035 5.3817 8.5126 12.1972 1.0359 1.0359 1.0583 1.0583 1.1069 1.1069 1.0985 1.0985 1.1029 1.1029 1.0774 1.0764
irintensity: 0.0000 1.6628 3.5768 0.0000 0.9745 0.0200 0.0000 2.9609 18.3562 0.0000 2.7801 1.4334 2.8123 0.0001 0.4437 22.9240 1.1244 2.6007 1.1855 0.0000 9.2481 80.1218 45.4415 0.0000 18.3539 7.7952 151.0188 0.0001 8.2223 1.0257 3.5755 347.3529 5.7084 19.3136 551.7703 86.4442 702.8596 4.8225 158.2471 0.0000 10.6041 67.9956 39.7169 0.0000 0.0001 6.4936 47.6952 45.4985 38.5361 1394.3099 0.0157 25.1709 20.6659 1.4146 51.6040 46.1890 0.7456 14.1083 69.6354 544.6498 13.4282 25.5991 25.1831 14.1510 0.0023 12.5894 41.5437 15.9959 0.0006 90.9811 0.3943 46.4597
temp: 298.150 k
press: 1.00000 atm
elementType: 8 8 8 8 8 7 7 6 6 6 6 6 6 6 1 1 1 1 1 1 1 1 1 1 1 1
symmnumber: 1
zpe: 524550.1 jmol-1
zpe.correction: 0.199791 hartree
zpe.thermalcorrener: 0.215101 hartree
zpe.thermalcorrenthalpy: 0.216045 hartree
zpe.thermalcorrgfe: 0.155126 hartree
zpe.sumelectzpe: -758.499538 hartree
zpe.sumelectthermal: -758.484227 hartree
zpe.sumelectthermalent: -758.483283 hartree
zpe.sumelectthermalfe: -758.544202 hartree
dipole: 0.0000 -7.6920 0.0009
dipole: 7.6920
quadrupole: -53.7237 -96.5393 -80.4091
quadrupole: 0.0000 0.0028 0.0014
quadrupole: 23.1670 -19.6486 -3.5184 0.0000 0.0028 0.0014
hfenergy: -758.6993285 hartree
pointgroup: C01 [X(C7H12N2O5)]
dipole: -0.0000255 -3.0262852 0.0003444 debye
dipolederiv: -1.6427123 0.4967984 -0.0000898 0.7754498 -0.8742833 0.0001098 -0.0001441 0.000155 -0.3154971 -1.642738 -0.4967858 -0.0000852 -0.7754341 -0.8742592 -0.0001016 -0.0000264 0.000023 -0.3154972 -0.6348127 -0.000002 -0.0000421 -0.0000021 -0.8514631 -0.0001854 -0.0001 0.0002308 -0.3008926 -0.7641051 -0.1639599 0.0000748 -0.151518 -0.8453056 0.0002094 0.0000538 0.0001157 -0.3024528 -0.7640996 0.1639587 -0.0000707 0.1515142 -0.8453111 0.0000946 -0.000017 -0.0001197 -0.3024533 -2.4428543 0.235663 -0.0000637 0.2700198 -0.4985008 0.000037 0.0002293 -0.0000394 -0.3912195 -2.4428636 -0.23563 -0.000128 -0.2699901 -0.4984915 0.0000347 -0.0005118 -0.0000513 -0.3912194 1.0519012 -0.2506367 0.000058 -0.0584518 0.2678976 0.0000331 -0.0000427 0.0000509 0.3522607 1.0519095 0.2506236 0.0000202 0.0584379 0.2678921 0.0000068 0.0000473 0.0000091 0.3522606 -0.0729277 0.0995708 -0.0000175 0.0754253 -0.0505793 0.000016 -0.0000102 0.0000157 0.0655798 -0.0729316 -0.099571 -0.0000034 -0.0754251 -0.0505763 0.0000061 -0.0000013 0.0000049 0.0655798 2.8428846 -0.0000117 0.0002116 -0.0000102 1.4092094 0.0002148 0.0003758 -0.0000985 0.3711939 2.6502528 -0.1757973 -0.0001064 -0.1295368 1.4809067 -0.0003836 -0.0001203 -0.0003235 0.3373875 2.6502586 0.175778 0.0002741 0.1295197 1.480899 -0.0000673 0.0003345 0.0000787 0.3373872 -0.0609129 0.0427388 0.0053105 -0.0474359 0.0083622 0.0908789 0.0450634 0.0918678 -0.0565375 -0.0609438 0.0427386 -0.0053355 -0.0474466 0.0082779 -0.0909078 -0.0450353 -0.0919074 -0.0564623 -0.0609324 -0.042742 0.0053158 0.0474379 0.0083092 -0.0908935 0.0450354 -0.0918907 -0.056486 -0.0609239 -0.0427334 -0.0053267 0.0474466 0.0083305 0.0908934 -0.0450597 0.0918861 -0.0565134 -0.1705239 -0.0026498 0.0000108 -0.0219554 0.0711746 0.0000116 0.0000148 0.0000102 0.1184314 0.112054 -0.0509156 0.0650142 0.0051899 0.0097781 0.0884774 0.04163 0.1096247 -0.0636752 0.1120466 -0.0509509 -0.0650069 0.0051642 0.0096972 -0.0885074 -0.0416468 -0.1096494 -0.0635854 -0.1705236 0.0026543 -0.0000067 0.0219597 0.071174 0.0000013 -0.0000034 0.0000031 0.1184313 0.1120506 0.0509362 0.0650093 -0.0051762 0.0097257 -0.0884974 0.0416379 -0.1096412 -0.0636168 0.1120522 0.0509266 -0.0650084 -0.0051817 0.0097482 0.0884892 -0.0416348 0.1096342 -0.0636436 0.1846975 -0.0328745 0.0000541 -0.0300405 0.1336948 0.000039 0.0000498 0.0000342 0.34062 0.1846978 0.0328737 -0.0000624 0.0300395 0.1336929 -0.0000092 -0.0001182 -0.0000231 0.3406199 unknown
polarizability: 168.6535914|-0.0004894|110.1477899|0.0047651|-0.0043493|65.8960881 unknown
InChI: InChI=1S/C7H12N2O5/c1-3-13-6(11)8-5(10)9-7(12)14-4-2/h8-9H,3-4H2,1-2H3
charge 0 multiplicity 1
26 atoms
O  3.304243 -0.728126 -0.000132
O  -3.304286 -0.728068 -0.000719
O  0.000005 2.023458 -0.000488
O  2.90867 1.594446 -0.000719
O  -2.908669 1.594496 -0.000559
N  1.163512 -0.039242 -0.000107
N  -1.163538 -0.039222 -0.000382
C  4.774959 -0.462809 -0.000253
C  -4.774998 -0.462724 -0.000734
C  5.467386 -1.821005 -0.000007
C  -5.467449 -1.820907 -0.000663
C  -0.000006 0.781169 -0.000052
C  2.492947 0.423693 -0.000444
C  -2.492966 0.423735 -0.000726
H  5.017912 0.137124 -0.89566
H  5.017994 0.137488 0.894887
H  -5.017985 0.137445 0.894505
H  -5.017975 0.137347 -0.896042
H  6.56315 -1.677764 -0.000082
H  5.195093 -2.404592 0.895896
H  5.195016 -2.404954 -0.89565
H  -6.563211 -1.677646 -0.000686
H  -5.195117 -2.404732 -0.896399
H  -5.19514 -2.404627 0.895148
H  1.079266 -1.058951 0.000126
H  -1.079309 -1.058933 -0.000461
