program: Gaussian 09
title: 000231378
version: EM64L-G09RevD.01
frameworkgroup: C1[X(C9H6N2O3)]
method: RPBEPBE
basis: SDD
operation: Freq
keyword: #pfreq=noraman
keyword: PBEPBE/SDD
title: #p freq=noraman PBEPBE/SDD
converged: YES YES NO YES
title: Mulliken charges:
elementType: O O O N N C C C C C C C C C H H H H H H
charge: -0.256203 -0.208348 -0.221098 -0.348660 0.024454 0.299044 0.138562 0.219731 -0.290427 -0.356127 0.065117 -0.365362 -0.213151 -0.218594 0.305882 0.286792 0.292793 0.247587 0.255439 0.342570
chargesum: 0.00000
title: Mulliken charges with hydrogens summed into heavy atoms:
elementType: O O O N N C C C C C C C C C
charge: -0.256203 -0.208348 -0.221098 -0.006090 0.024454 0.299044 0.138562 0.219731 0.015455 -0.069335 0.065117 -0.072569 0.034436 0.036845
polarizability: 1.91988064e+02 -9.11303663e+00 1.53038285e+02 -5.28979022e-03 -1.45892032e-02 4.62095529e+01
1716.lowfreq: -9.4408 0.0005 0.0007 0.0007 3.0907 6.9787 12.7655 70.8236 156.2372
frequency: 10.7234 70.8216 156.2369 187.1061 224.5267 244.3875 299.6105 357.5792 394.7621 445.1123 464.7536 499.3423 519.5406 565.3857 579.7416 600.5715 641.3583 710.3598 719.9707 740.6757 778.9163 780.1962 820.7133 838.9838 839.7662 898.7144 967.0269 981.4184 1013.6512 1062.6739 1083.1917 1105.9502 1153.3381 1178.5704 1193.4810 1222.1495 1244.6896 1285.0195 1351.0299 1378.0942 1391.7174 1424.9932 1444.6813 1477.4663 1550.4169 1600.6564 1623.2873 1630.7464 3154.0381 3170.7038 3176.8806 3188.7615 3241.9135 3522.9401
redmass: 13.3722 8.6323 5.0141 4.6128 9.5621 4.5982 9.7953 9.4308 8.1610 4.2761 3.8987 8.2172 6.8560 6.1642 3.3065 8.1026 4.0615 4.0973 10.2609 1.5490 2.3668 5.5090 1.3676 6.9324 2.0212 6.1924 1.2723 1.3693 1.3626 3.6580 1.9771 2.2465 1.9117 2.8068 2.0568 1.5261 1.9647 3.0732 4.4215 3.9719 2.5506 2.5422 2.4055 4.1044 6.3591 5.6803 5.9469 6.3281 1.0882 1.0939 1.0934 1.0966 1.0943 1.0779
irintensity: 0.0537 10.6197 4.1261 1.2674 7.4076 0.9599 3.2728 1.1157 0.8023 9.8026 0.2607 4.8017 6.3404 4.7445 0.6982 0.1614 0.7104 34.4297 14.0638 46.7930 104.5267 6.5825 51.2839 17.9116 10.5569 3.7006 3.4538 0.0307 2.5639 40.5927 6.2511 8.0083 1.6524 324.7720 126.2724 5.1293 51.8328 26.0924 57.3647 29.4686 31.1722 45.1030 3.1055 43.5596 4.1316 87.1647 235.0169 304.5960 1.2156 7.1380 3.9015 4.3309 15.3028 77.5688
temp: 298.150 k
press: 1.00000 atm
elementType: 8 8 8 7 7 6 6 6 6 6 6 6 6 6 1 1 1 1 1 1
symmnumber: 1
zpe: 366113.2 jmol-1
zpe.correction: 0.139445 hartree
zpe.thermalcorrener: 0.150005 hartree
zpe.thermalcorrenthalpy: 0.150949 hartree
zpe.thermalcorrgfe: 0.101214 hartree
zpe.sumelectzpe: -680.701017 hartree
zpe.sumelectthermal: -680.690457 hartree
zpe.sumelectthermalent: -680.689513 hartree
zpe.sumelectthermalfe: -680.739248 hartree
dipole: 2.7968 -0.6676 0.0001
dipole: 2.8754
quadrupole: -98.4864 -66.5090 -81.1404
quadrupole: -18.7629 -0.0027 0.0014
quadrupole: -16.4411 15.5363 0.9049 -18.7629 -0.0027 0.0014
hfenergy: -680.8404621 hartree
pointgroup: C01 [X(C9H6N2O3)]
dipole: 1.0974163 -0.274612 0.0000438 debye
dipolederiv: -1.198828 -0.3259031 0.0002872 -0.4858697 -0.5862639 0.0002185 -0.000336 -0.0002036 -0.3642173 -1.100971 0.1530241 -0.0001853 0.1918966 -0.472606 0.0001566 -0.0005686 0.0002755 -0.231831 -0.4811626 -0.0847276 -0.0000651 -0.2712852 -0.7723572 0.0005574 -0.0001175 0.0001916 -0.2345562 -0.6630064 0.270467 -0.0000155 -0.8901799 -0.5322914 -0.0000065 0.0001342 0.0000695 -0.2789612 1.9114654 0.1154289 0.0002904 0.4751951 1.0771987 -0.0008184 0.0004759 -0.0005813 0.190535 0.2021739 -0.1019116 -0.0000333 -0.5355609 0.4912744 -0.000011 0.0002684 0.000004 0.0837567 -0.3654947 -0.1903807 0.0000348 0.3859338 -0.2820823 -0.0000197 0.0000777 -0.0000134 -0.0052758 -0.6673815 0.0105792 -0.0000228 -0.5026001 -0.3015979 0.0001604 0.000141 0.0001303 0.0269183 -0.610992 0.3492015 -0.000022 0.417948 -0.4007058 -0.0000134 -0.0001526 -0.0000368 -0.2127377 0.3129363 0.0987743 -0.0000793 -0.3731459 0.0866902 0.0000357 -0.0000647 -0.0000182 -0.0678241 1.324406 0.2508288 -0.0002547 0.7009463 0.9209513 -0.0002259 0.0001627 0.0000886 0.1937499 0.1965274 -0.0134456 -0.000055 0.5401051 0.1500642 -0.0000649 -0.000155 -0.0000673 -0.0728454 -0.6434506 -0.1149012 0.0000712 -0.0689058 0.1304815 -0.0000033 0.0001132 -0.0000239 -0.1660129 1.137811 -0.3227493 -0.0000624 0.4520791 0.1070033 -0.0000747 -0.0002222 -0.0000028 -0.0417955 0.1378923 -0.0858348 0.000037 0.0119608 0.081 0.0000022 0.0000962 0.0000284 0.189179 0.0638424 -0.0823334 0.0000308 -0.0182634 0.0892263 0.0000121 0.0000221 0.0000279 0.1517257 0.0652496 0.0575997 0.0000354 0.0070594 0.1341753 -0.0000114 0.0000239 0.000039 0.1644293 0.0769397 0.02352 0.0000066 0.0192675 -0.0774923 0.0000082 -0.0000036 0.0000029 0.1608016 0.0775127 0.0344082 -0.0000119 0.019393 -0.0373965 0.0000443 0.0001042 0.0000288 0.1753894 0.2245301 -0.0416444 0.0000139 -0.0759737 0.1947281 0.0000538 0.0000008 0.0000611 0.3395723 unknown
polarizability: 191.7850571|-9.5348472|153.2412923|-0.0054483|-0.0145308|46.2095529 unknown
InChI: InChI=1S/C9H6N2O3/c12-9-7-2-1-3-8(11(13)14)6(7)4-5-10-9/h1-5,10H
charge 0 multiplicity 1
20 atoms
O  3.488438 0.806394 -0.000111
O  -3.755398 0.134014 -0.00061
O  -2.587994 -1.810227 0.001074
N  2.582848 -1.336507 -0.000125
N  -2.637889 -0.517411 0.000519
C  -0.069511 -0.344866 0.000083
C  1.053893 0.566006 -0.000223
C  -1.374084 0.268011 0.00024
C  0.205712 -1.767377 0.000165
C  0.873444 1.969742 -0.000238
C  2.454281 0.071799 -0.000649
C  -1.539519 1.66892 0.00015
C  -0.417916 2.523911 -0.00006
C  1.510762 -2.213162 0.000112
H  -0.609942 -2.484722 0.000448
H  1.771458 2.596211 -0.000459
H  -2.557121 2.067264 0.000264
H  -0.55928 3.608429 -0.000105
H  1.754407 -3.278588 0.000344
H  3.546213 -1.685044 -0.00002
