program: Gaussian 09
title: 000231372
version: EM64L-G09RevD.01
frameworkgroup: C1[X(C8H18N2O)]
method: RPBEPBE
basis: SDD
operation: Freq
keyword: #p
keyword: freq=noraman
keyword: PBEPBE/SDD
title: #p freq=noraman PBEPBE/SDD
converged: NO YES NO NO
title: Mulliken charges:
elementType: O N N C C C C C C C C H H H H H H H H H H H H H H H H H H
charge: -0.446218 -0.344046 -0.579922 -0.000939 -0.178476 -0.432685 -0.440274 -0.393000 -0.385789 -0.332916 -0.400982 0.166745 0.245369 0.208746 0.211856 0.221758 0.180857 0.189596 0.202817 0.199682 0.200477 0.263341 0.226253 0.159024 0.322700 0.170946 0.227400 0.260243 0.277436
chargesum: 0.00000
title: Mulliken charges with hydrogens summed into heavy atoms:
elementType: O N N C C C C C C C C
charge: -0.123517 -0.080705 -0.042243 0.165807 0.066892 -0.012083 -0.037659 -0.000587 0.014371 0.052361 -0.002635
polarizability: 1.23724682e+02 4.50819755e-01 9.64976289e+01 -2.79476452e-01 2.61715585e-01 8.70317282e+01
1716.lowfreq: -15.5957 0.0002 0.0006 0.0007 3.4304 11.7338 48.3971 59.8782 79.3824
frequency: 48.1921 59.8732 79.3378 121.2226 159.7276 178.0967 216.2582 242.9179 270.1070 306.7953 331.3264 359.0646 394.7729 413.0881 438.3712 483.2934 525.3661 572.6131 596.4672 742.2318 781.9855 814.0250 837.9385 840.0691 878.3307 907.5598 947.0948 960.9032 992.4243 1034.7259 1042.1426 1058.0016 1086.0245 1100.0318 1106.7068 1113.5156 1143.1295 1160.0120 1179.4402 1190.8980 1207.9680 1238.1607 1249.8976 1261.4231 1281.7295 1290.2146 1304.0838 1325.8579 1328.4308 1337.5049 1341.6152 1342.3332 1364.6699 1373.0497 1394.5104 1460.5972 1462.4941 1466.7656 1468.8293 1473.8173 1481.4254 1493.4955 1637.9453 2775.1430 2814.1860 2852.3639 2951.6351 2967.5132 2974.5103 2984.2648 3031.8487 3034.0186 3035.1428 3038.8891 3047.6691 3052.7328 3055.0386 3406.6347 3464.8212 3536.3091 3593.3081
redmass: 3.3616 1.7201 3.6255 3.2545 2.7892 2.1678 1.4404 2.6997 2.8055 1.7280 1.2299 2.0583 3.5509 3.6549 3.1879 2.7134 2.5073 2.1973 1.4058 1.3583 1.8550 1.1451 1.6907 2.0024 2.2223 1.6707 2.3466 1.5723 3.2128 2.6426 1.7042 1.3090 1.7694 1.6895 2.7673 2.5106 1.7021 2.6535 1.8827 1.3998 1.5255 1.3167 1.3000 1.2964 1.1384 1.2881 1.2687 1.3301 1.4030 1.3951 1.4696 1.4853 1.5394 1.1885 1.5048 1.1107 1.0914 1.1066 1.1836 1.0926 1.0729 1.0958 1.0953 1.0786 1.0718 1.0720 1.0665 1.0640 1.0618 1.0614 1.0916 1.0873 1.0900 1.0987 1.0990 1.0913 1.0967 1.0731 1.0449 1.0656 1.0978
irintensity: 0.8922 3.9125 1.1532 1.1927 0.7646 3.5703 50.3742 13.3221 2.2423 0.9475 75.5104 37.8208 57.6814 6.9826 0.4119 2.6001 5.1899 48.4723 195.5035 78.3054 12.3390 0.5620 10.7419 16.7704 14.1130 12.0819 1.3728 1.5410 78.3139 2.2782 5.2705 9.8497 1.7830 8.0001 24.9483 9.3972 7.4597 53.8645 3.9553 6.0864 12.3118 1.8898 7.5073 16.2151 9.5654 2.0149 4.4969 0.4681 9.3212 0.0830 1.9609 11.5484 2.8326 28.1463 9.1288 11.5887 3.5512 31.6502 31.5154 8.2796 2.0917 4.7216 45.1022 85.8527 155.5159 112.0887 33.3067 36.1458 35.8546 23.0755 29.6166 40.9563 40.5456 28.8880 16.5815 58.1633 98.3590 7.4413 0.7868 4.0535 0.4016
temp: 298.150 k
press: 1.00000 atm
elementType: 8 7 7 6 6 6 6 6 6 6 6 1 1 1 1 1 1 1 1 1 1 1 1 1 1 1 1 1 1
symmnumber: 1
zpe: 681374.6 jmol-1
zpe.correction: 0.259522 hartree
zpe.thermalcorrener: 0.272104 hartree
zpe.thermalcorrenthalpy: 0.273049 hartree
zpe.thermalcorrgfe: 0.220663 hartree
zpe.sumelectzpe: -499.433264 hartree
zpe.sumelectthermal: -499.420681 hartree
zpe.sumelectthermalent: -499.419737 hartree
zpe.sumelectthermalfe: -499.472123 hartree
dipole: -0.3065 -0.0138 1.9535
dipole: 1.9774
quadrupole: -59.5856 -75.5524 -66.5347
quadrupole: 6.3399 0.1014 4.2810
quadrupole: 7.6386 -8.3282 0.6895 6.3399 0.1014 4.2810
hfenergy: -499.6927859 hartree
pointgroup: C01 [X(C8H18N2O1)]
dipole: -0.131413 -0.0380012 0.7658565 debye
polarizability: 123.6046287|1.8512802|96.5883187|0.3081011|0.6021468|87.0610919 unknown
InChI: InChI=1S/C8H18N2O/c9-5-6-10-7-3-1-2-4-8(7)11/h7-8,10-11H,1-6,9H2
charge 0 multiplicity 1
29 atoms
O  -1.005634 2.325523 0.211688
N  1.027327 0.384837 -0.29829
N  4.694411 -0.213944 0.36057
C  -0.280613 -0.060476 0.221415
C  -1.35647 0.953066 -0.235884
C  -0.654121 -1.482203 -0.273632
C  -2.767371 0.551869 0.229779
C  -2.064111 -1.900678 0.202925
C  -3.131751 -0.875609 -0.247814
C  2.217758 -0.243702 0.304822
C  3.50363 0.356303 -0.29706
H  -0.296919 -0.076923 1.348927
H  -1.316798 1.031771 -1.337434
H  0.100089 -2.211238 0.078057
H  -0.606119 -1.480068 -1.380724
H  -3.496231 1.293913 -0.145976
H  -2.805835 0.585874 1.340635
H  -2.073986 -1.975184 1.310378
H  -2.310451 -2.90696 -0.186534
H  -3.200059 -0.883006 -1.354838
H  -4.130214 -1.158466 0.136945
H  1.077192 1.414541 -0.25175
H  2.217689 -1.329626 0.103428
H  2.248398 -0.124987 1.42211
H  -1.134376 2.368441 1.194858
H  3.439163 1.472815 -0.231862
H  3.536156 0.103165 -1.371848
H  4.77657 0.017835 1.355216
H  5.572972 -0.070484 -0.144209
