program: Gaussian 09
title: 000231368
version: EM64L-G09RevD.01
frameworkgroup: C1[X(C16H15N3O2S)]
method: RPBEPBE
basis: SDD
operation: Freq
keyword: #p
keyword: freq=noraman
keyword: PBEPBE/SDD
title: #p freq=noraman PBEPBE/SDD
converged: NO YES NO NO
title: Mulliken charges:
elementType: S O O N N N C C C C C C C C C C C C C C C C H H H H H H H H H H H H H H H
charge: 0.941732 -0.544034 -0.549099 -0.476518 -0.097598 -0.716664 0.235962 0.431452 -0.010339 0.197692 -0.572251 0.445357 -0.071696 -0.373585 -0.443853 -0.300977 -0.815190 -0.330991 -0.210062 -0.235254 -0.263847 -0.223593 0.224179 0.308736 0.239903 0.228452 0.329254 0.240118 0.231624 0.240683 0.257200 0.281618 0.276259 0.229720 0.232586 0.330862 0.332165
chargesum: 0.00000
title: Mulliken charges with hydrogens summed into heavy atoms:
elementType: S O O N N N C C C C C C C C C C C C C C C C
charge: 0.941732 -0.544034 -0.549099 -0.167782 -0.097598 -0.053636 0.235962 0.431452 -0.010339 0.197692 -0.348072 0.445357 -0.071696 -0.133682 -0.215401 0.028277 -0.102765 -0.073792 0.071556 0.041005 -0.034127 0.008992
polarizability: 4.25061592e+02 2.34736222e+01 2.53994878e+02 -3.03195739e+00 -3.26939847e-01 1.10640233e+02
1716.lowfreq: -4.7112 -1.3784 -0.0012 0.0002 0.0010 3.4413 24.5427 28.7817 50.1088
frequency: 24.1478 28.6407 50.0968 55.3288 77.0804 118.0053 121.3016 128.9454 155.3682 170.6095 176.2527 191.9058 231.2330 235.5033 272.1201 275.3878 290.4313 312.0802 313.2737 365.1106 373.0446 418.2991 421.5284 428.9157 469.8868 474.2570 496.4229 521.2395 527.9992 538.6905 569.5799 575.9613 612.1783 617.4614 642.6850 682.2703 701.6919 735.2404 757.1651 770.5054 786.9804 792.9549 807.2764 824.3906 830.2959 861.7144 869.6207 878.2438 878.8201 904.5944 959.8290 960.6188 974.1898 987.0185 993.6178 1006.2350 1009.4878 1028.1462 1046.3171 1054.8555 1069.0940 1071.3821 1117.7286 1133.1187 1173.0058 1181.6780 1201.3038 1252.6367 1268.4535 1280.0289 1298.7591 1304.6157 1371.0780 1389.4618 1400.2655 1409.1508 1414.0717 1422.9389 1460.0758 1468.7865 1478.0141 1486.2525 1506.1486 1530.4697 1535.5806 1564.0722 1594.8409 1601.5116 1616.5651 1620.8618 2980.7384 3058.6728 3094.0012 3117.3001 3118.9927 3129.7734 3141.1443 3156.7686 3156.9089 3164.7360 3169.7928 3189.5876 3354.1880 3521.5332 3540.2366
redmass: 6.0620 5.6615 3.4014 7.0239 5.6371 3.8410 1.5313 8.2153 4.5177 3.7067 2.2913 1.9958 3.0047 5.8893 2.6113 2.8044 8.1082 6.9020 5.2235 5.7164 5.5603 3.0327 3.0700 9.3359 5.0531 4.1837 4.8279 5.5757 3.0076 2.8745 6.8195 2.7089 1.4405 7.0457 5.9246 3.5999 5.1335 3.2405 5.9633 1.3291 3.1446 4.5876 2.1733 4.0667 1.4764 1.5011 1.4483 3.7623 1.8319 4.2721 1.3712 1.3652 3.0138 5.2378 1.3264 1.3181 2.5515 2.7228 1.5722 2.3815 2.1183 1.5091 1.3604 1.5767 1.1174 1.1226 1.5886 1.7434 1.6368 3.3790 2.7108 1.8329 2.7068 3.9685 1.4813 3.1299 4.3338 3.1800 2.3190 1.0459 1.7597 1.5585 4.0717 3.1647 1.0999 4.7164 5.7141 3.6193 5.9925 6.5511 1.0376 1.0971 1.0988 1.0918 1.0901 1.0851 1.0894 1.0934 1.0928 1.0949 1.1000 1.0954 1.0414 1.0997 1.0755
irintensity: 0.3677 0.3979 2.5658 0.2367 1.5119 1.3345 35.7618 2.2034 6.5845 1.0266 0.6849 0.6980 2.4899 5.8548 1.2617 4.2535 4.5877 29.8139 0.6267 0.1392 6.1199 0.8771 3.3868 80.5165 18.8100 96.2460 32.5073 4.4979 84.9675 48.2372 13.7482 5.5630 35.7054 1.1466 10.2739 2.1512 1.6834 0.3412 0.4240 83.1240 0.2976 28.0155 205.0818 83.9454 31.1283 44.2642 48.5866 0.8144 2.1181 59.8719 0.0872 2.8867 0.2712 7.8574 0.1515 3.0006 2.8279 8.5299 7.3050 84.9331 7.8431 19.7890 1.1916 5.9551 0.4584 24.7853 29.8878 13.2688 30.6007 26.9723 23.5225 0.2045 4.8388 176.5624 27.6644 128.0241 25.7283 12.7643 0.7866 15.6723 58.8931 128.1034 265.5172 542.5338 46.6319 38.8488 562.1393 2.5029 25.4349 18.1390 24.7765 13.8125 17.4857 12.0475 19.4460 0.2995 10.1846 30.6352 4.7627 5.9471 23.9206 25.9713 25.2553 21.6767 23.2134
temp: 298.150 k
press: 1.00000 atm
elementType: 16 8 8 7 7 7 6 6 6 6 6 6 6 6 6 6 6 6 6 6 6 6 1 1 1 1 1 1 1 1 1 1 1 1 1 1 1
symmnumber: 1
zpe: 732709.0 jmol-1
zpe.correction: 0.279074 hartree
zpe.thermalcorrener: 0.299305 hartree
zpe.thermalcorrenthalpy: 0.300250 hartree
zpe.thermalcorrgfe: 0.229153 hartree
zpe.sumelectzpe: -1329.760034 hartree
zpe.sumelectthermal: -1329.739803 hartree
zpe.sumelectthermalent: -1329.738859 hartree
zpe.sumelectthermalfe: -1329.809956 hartree
dipole: 7.0160 -3.3909 2.9038
dipole: 8.3159
quadrupole: -135.1305 -117.4607 -144.9075
quadrupole: -2.9413 -20.1627 3.3661
quadrupole: -2.6309 15.0389 -12.4079 -2.9413 -20.1627 3.3661
hfenergy: -1330.0391084 hartree
pointgroup: C01 [X(C16H15N3O2S1)]
dipole: 2.6988612 1.4571306 -1.1389649 debye
polarizability: 426.3378952|-18.1634483|252.5571549|-2.9493309|4.9646206|110.8016529 unknown
InChI: InChI=1S/C16H15N3O2S/c1-11-10-16(19-15-5-3-2-4-14(11)15)18-12-6-8-13(9-7-12)22(17,20)21/h2-10,18H,17H2,1H3
charge 0 multiplicity 1
37 atoms
S  -5.556407 -0.64204 0.139727
O  -5.486755 -2.150499 0.755838
O  -6.529647 0.527594 0.730201
N  0.058352 1.656859 0.002606
N  1.497339 -0.247029 -0.07944
N  -6.027036 -0.831856 -1.635681
C  3.966589 0.102162 -0.145294
C  3.763658 1.537747 -0.105536
C  2.793719 -0.746508 -0.13003
C  1.34287 1.088625 -0.043964
C  2.455979 2.010712 -0.056037
C  -1.21711 1.059511 0.02807
C  -3.819836 0.037563 0.081854
C  5.259794 -0.505726 -0.198163
C  -2.341729 1.939139 0.068414
C  -1.428477 -0.3504 0.026821
C  4.938685 2.493037 -0.116892
C  2.959321 -2.16617 -0.168087
C  -3.651325 1.433288 0.093071
C  -2.740671 -0.860411 0.054082
C  5.396732 -1.898232 -0.235121
C  4.237319 -2.732615 -0.219854
H  2.266332 3.090816 -0.025154
H  0.051466 2.678445 0.01978
H  6.153934 0.126854 -0.209877
H  -2.186339 3.025387 0.082434
H  -0.558048 -1.006787 0.005422
H  5.554338 2.360575 -1.026283
H  4.600763 3.542074 -0.085102
H  5.602116 2.322351 0.751633
H  2.056767 -2.784799 -0.155022
H  -4.520488 2.09607 0.145732
H  -2.920467 -1.940024 0.07759
H  6.392717 -2.352337 -0.275637
H  4.352822 -3.821785 -0.248526
H  -6.190494 -1.838341 -1.811311
H  -6.86979 -0.253248 -1.796062
