program: Gaussian 09
title: 000231365
version: EM64L-G09RevD.01
frameworkgroup: C1[X(C9H11Cl)]
method: RPBEPBE
basis: SDD
operation: Freq
keyword: #pfreq=noraman
keyword: PBEPBE/SDD
title: #p freq=noraman PBEPBE/SDD
converged: YES YES NO NO
title: Mulliken charges:
elementType: Cl C C C C C C C C C H H H H H H H H H H H
charge: -0.090082 -0.538893 -0.305127 0.505599 -0.640737 -0.395117 -0.403531 -0.224237 -0.227210 -0.240139 0.205657 0.240042 0.280892 0.246165 0.208915 0.233925 0.241300 0.225976 0.225256 0.223683 0.227662
chargesum: 0.00000
title: Mulliken charges with hydrogens summed into heavy atoms:
elementType: Cl C C C C C C C C C
charge: -0.090082 -0.093193 -0.024236 0.505599 0.048268 -0.153818 -0.177554 0.001019 -0.003527 -0.012476
polarizability: 1.24132208e+02 -8.21708362e+00 1.07024357e+02 1.22915745e+01 8.96663605e+00 6.88752728e+01
1716.lowfreq: -14.1639 -0.0008 0.0020 0.0027 4.0130 11.1224 31.6355 60.9897 88.7471
frequency: 30.3017 60.9052 88.7410 203.0143 233.4842 282.0037 326.4519 355.1932 378.2977 404.3788 496.7874 552.7509 592.9257 617.1824 704.9363 753.2533 810.6148 852.9231 886.7182 896.2920 925.3572 975.7328 990.4749 995.1746 1003.9328 1027.1373 1075.6622 1092.3149 1121.3810 1163.0976 1172.5253 1188.4697 1216.5477 1260.0829 1282.8819 1327.0897 1342.5561 1383.8087 1391.9466 1440.4877 1452.3176 1462.1272 1475.6401 1484.7586 1594.6634 1615.5615 2972.1521 2982.5428 3044.9595 3065.9361 3081.3023 3108.0852 3108.9525 3124.2747 3135.7797 3147.1591 3163.3647
redmass: 4.4617 4.8111 3.8001 5.6296 1.1116 2.7219 2.9143 3.0595 2.4767 2.8061 3.0937 4.1797 4.2702 6.3287 1.7539 1.9738 3.1931 1.2520 1.6793 1.8746 1.4808 1.3948 5.7764 1.3312 1.5312 2.1724 1.6080 2.3495 1.6547 1.2729 1.0533 1.1167 2.3853 1.2631 1.3281 1.3024 1.4632 7.7199 1.2179 2.1090 1.1004 1.0628 1.0536 2.3315 6.0674 6.1561 1.0623 1.0397 1.0946 1.0920 1.0940 1.0978 1.0901 1.0857 1.0913 1.0961 1.1016
irintensity: 0.7133 1.3965 0.5848 0.6771 0.3297 0.8162 1.1809 1.8514 4.3962 0.0421 10.9908 26.6684 10.8248 0.2859 54.4966 38.0732 4.2530 0.2709 2.7479 4.3147 1.9567 0.2650 0.1762 0.0332 12.6038 6.3906 18.8714 5.4453 17.8005 11.3355 0.4626 0.2795 0.2480 18.5783 1.9198 1.4010 3.5336 0.2416 18.1225 9.1723 3.3544 18.4237 8.5888 16.0784 1.2992 5.2452 16.6741 34.9701 4.2944 3.1586 31.9561 17.9999 18.9438 0.3300 18.2748 40.9693 18.6484
temp: 298.150 k
press: 1.00000 atm
elementType: 17 6 6 6 6 6 6 6 6 6 1 1 1 1 1 1 1 1 1 1 1
symmnumber: 1
zpe: 454122.7 jmol-1
zpe.correction: 0.172966 hartree
zpe.thermalcorrener: 0.182795 hartree
zpe.thermalcorrenthalpy: 0.183739 hartree
zpe.thermalcorrgfe: 0.136360 hartree
zpe.sumelectzpe: -808.879594 hartree
zpe.sumelectthermal: -808.869765 hartree
zpe.sumelectthermalent: -808.868821 hartree
zpe.sumelectthermalfe: -808.916200 hartree
dipole: 0.0007 -2.3213 0.5800
dipole: 2.3927
quadrupole: -63.0410 -64.0077 -68.1235
quadrupole: -6.4225 3.6906 3.9307
quadrupole: 2.0164 1.0497 -3.0661 -6.4225 3.6906 3.9307
hfenergy: -809.0525601 hartree
pointgroup: C01 [X(C9H11Cl1)]
dipole: 0.0512156 -0.8727772 0.3489754 debye
dipolederiv: -0.3028526 -0.0159659 0.0287413 -0.0174923 -0.567254 0.2156253 0.0593681 0.1504208 -0.2854176 -0.0518042 0.0407747 0.0337884 -0.0368206 0.0190957 0.0448883 0.1755436 0.024575 0.0302534 0.3174333 -0.0159376 -0.0514266 0.0653596 0.7288526 -0.2409868 -0.1949897 -0.2258951 0.3323135 0.2999272 -0.0034431 0.0453145 -0.0696375 -0.0284366 -0.0066761 0.0748011 0.007511 -0.0707479 -0.1886893 0.0238265 -0.0052718 0.0497684 -0.0434699 0.0590566 0.0539575 0.0368328 0.0211223 -0.1045544 0.0700451 0.0477921 0.1196938 0.0117517 0.0731557 -0.0033907 0.0343508 -0.1056562 -0.1345661 -0.0578934 0.0225627 -0.0701796 0.0410322 0.0391089 0.0027713 0.0475346 -0.1477635 -0.0257515 -0.0826394 0.0254502 -0.0872141 0.0980009 0.0533086 0.0304408 0.0371969 -0.1213766 -0.018018 0.0526691 0.0582709 0.0703775 0.050171 0.0774013 0.0695414 0.07834 -0.1048916 0.0505878 -0.0347331 0.0765159 -0.0374331 -0.0787663 0.0087212 0.0656108 0.019016 -0.140835 0.0072733 -0.00874 0.0056255 0.0716656 -0.108509 0.0980285 -0.0084901 0.0724869 0.0457276 0.0036696 -0.0192019 -0.0350322 -0.0438804 0.0229928 -0.1268081 -0.0552971 -0.0582766 -0.0167549 0.0275056 -0.0396671 -0.0614523 -0.0385676 -0.0630263 -0.0355451 -0.0410928 -0.0133133 -0.0551866 -0.0519427 0.0087224 0.0873784 -0.0153718 0.1091971 0.0228332 0.1258755 0.0110976 -0.0270632 0.0726059 0.0017052 -0.0134673 0.0111203 -0.1458295 0.0666159 -0.0232019 0.0769208 0.0886206 0.0700152 0.0032873 -0.0346691 -0.0499942 0.0475229 -0.1091155 -0.087725 -0.0775889 -0.0489448 0.0383296 -0.0792695 -0.0721401 -0.0751489 -0.0000483 -0.0624757 -0.0624846 -0.0577549 0.0997066 0.0476678 0.1139228 -0.0100029 0.1011622 -0.0688556 -0.037369 -0.0134149 -0.0266681 0.1253775 0.0388059 0.0833588 -0.0057609 0.1033251 -0.0795624 -0.0449227 -0.011167 -0.0436102 0.1390254 0.018183 -0.0768375 -0.0650817 -0.0886636 -0.0338093 -0.0842644 -0.074242 -0.0825017 0.1097007 -0.1138255 0.0360165 -0.0771352 0.0379313 0.0889503 -0.0105802 -0.0824142 -0.0106745 0.1327903 unknown
polarizability: 125.6252818|-5.6247882|108.2249887|10.7449113|4.2595058|66.1815676 unknown
InChI: InChI=1S/C9H11Cl/c1-8(10)7-9-5-3-2-4-6-9/h2-6,8H,7H2,1H3
charge 0 multiplicity 1
21 atoms
Cl 2.314755 1.498603 -0.911515
C  1.210405 -0.442756 0.82047
C  2.215594 -0.334899 -0.345306
C  -0.24179 -0.21529 0.42672
C  3.632279 -0.784306 0.015837
C  -0.86419 1.044929 0.61079
C  -0.997489 -1.267303 -0.153281
C  -2.206693 1.251326 0.2205
C  -2.33937 -1.065351 -0.54646
C  -2.948799 0.197294 -0.360559
H  1.326891 -1.46634 1.23405
H  1.522141 0.260547 1.614505
H  1.836499 -0.845708 -1.245674
H  4.325894 -0.633771 -0.827695
H  3.627087 -1.861335 0.274837
H  4.01474 -0.221154 0.885029
H  -0.290102 1.868393 1.050351
H  -0.535172 -2.253734 -0.290966
H  -2.672026 2.232579 0.3675
H  -2.909495 -1.88943 -0.990381
H  -3.990158 0.356703 -0.662253
