program: Gaussian 09
title: 000231347
version: EM64L-G09RevD.01
frameworkgroup: C1[X(C9H16N2O2)]
method: RPBEPBE
basis: SDD
operation: Freq
keyword: #p
keyword: freq=noraman
keyword: PBEPBE/SDD
title: #p freq=noraman PBEPBE/SDD
converged: YES YES NO NO
title: Mulliken charges:
elementType: O O N N C C C C C C C C C H H H H H H H H H H H H H H H H
charge: -0.211468 -0.220502 -0.444697 -0.646614 -0.139291 -0.387164 -0.563587 -0.372045 0.210585 -0.696727 -0.047281 -0.617211 0.270701 0.225833 0.191511 0.213069 0.227673 0.236834 0.184705 0.265442 0.221428 0.200393 0.214363 0.234337 0.333284 0.225959 0.228771 0.317291 0.344408
chargesum: 0.00000
title: Mulliken charges with hydrogens summed into heavy atoms:
elementType: O O N N C C C C C C C C C
charge: -0.211468 -0.220502 -0.111412 0.015085 0.086543 0.017416 -0.099080 0.078102 0.210585 -0.060544 0.187056 -0.162480 0.270701
polarizability: 1.50293479e+02 -9.93183442e+00 1.17568933e+02 9.69511477e+00 -2.38461722e+00 8.83101131e+01
1716.lowfreq: -12.6695 -10.9662 -6.0643 -0.0007 -0.0007 -0.0004 14.7493 38.8277 55.5275
frequency: 13.9684 38.7440 55.3575 66.0430 86.4797 93.8692 100.9302 145.7077 154.6577 202.9560 223.9150 237.7903 272.9461 310.8191 374.5565 407.1233 422.9961 445.8934 485.0773 531.5115 548.5384 610.4159 616.6955 642.7736 687.6171 725.2616 747.2462 857.8124 875.1430 879.8174 898.8233 923.9456 950.1655 965.3690 1016.0577 1021.9358 1053.7075 1059.5425 1060.8548 1074.4846 1116.7794 1139.6699 1183.1286 1210.9880 1231.6034 1250.0071 1286.6140 1289.5734 1296.5571 1301.6818 1311.5740 1330.7450 1358.0952 1387.2130 1425.1392 1447.6304 1457.1464 1464.5767 1475.4838 1477.2101 1488.0275 1606.4085 1628.6367 1644.5110 1696.1514 2955.1991 2961.3292 2969.7809 2978.5919 2990.7990 3011.5280 3022.1118 3047.4384 3074.2835 3075.7682 3078.5306 3090.2585 3192.1166 3489.4906 3523.7643 3681.7925
redmass: 5.2426 4.9483 1.7978 3.0099 3.4303 2.9203 3.5284 3.7364 2.6087 3.5045 1.1884 3.4656 3.1960 3.8490 2.7838 1.8793 3.2746 1.6052 3.4294 2.4302 1.1711 1.4523 1.9775 1.7251 4.0366 2.6701 1.5393 1.4350 2.1636 2.8379 3.1337 1.6161 1.3437 2.1710 1.6377 2.0073 1.9755 2.1217 1.7892 2.2734 1.8538 2.3932 1.9157 1.4907 1.5239 1.2149 1.2804 1.2071 2.2254 1.3023 1.5193 1.3728 1.4524 1.2126 1.1974 1.5144 1.3148 1.0811 1.0460 1.0428 1.0889 1.1852 5.3369 4.4920 6.6425 1.0597 1.0601 1.0362 1.0686 1.0856 1.0985 1.0959 1.0976 1.0998 1.0992 1.0622 1.0913 1.1138 1.0766 1.0460 1.1039
irintensity: 6.8295 9.3868 0.8573 3.0037 0.7738 0.1476 2.5795 0.7479 0.7349 0.7194 0.0617 0.6722 1.7286 0.3576 1.2219 18.9843 1.1293 77.4130 19.1709 3.8900 213.8894 72.5098 17.4785 14.0893 10.8292 32.8904 17.2114 3.5876 11.2898 9.2478 10.3707 2.1017 86.8744 19.7654 9.4771 8.5991 9.9333 10.0603 5.8937 19.1608 41.2963 5.4640 87.7081 7.2867 96.4471 8.0827 15.6156 1.3756 137.0095 12.6913 8.9119 7.5988 2.2393 11.6192 22.2769 348.9893 199.6840 6.8246 2.0281 14.5926 15.0996 73.2312 86.4593 11.5029 353.9349 11.1930 27.4981 49.8061 26.8608 4.7179 5.0297 53.0152 3.9060 54.3173 55.9767 14.0304 6.9337 21.4376 82.3453 33.9125 37.6680
temp: 298.150 k
press: 1.00000 atm
elementType: 8 8 7 7 6 6 6 6 6 6 6 6 6 1 1 1 1 1 1 1 1 1 1 1 1 1 1 1 1
symmnumber: 1
zpe: 637223.7 jmol-1
zpe.correction: 0.242706 hartree
zpe.thermalcorrener: 0.258283 hartree
zpe.thermalcorrenthalpy: 0.259227 hartree
zpe.thermalcorrgfe: 0.197654 hartree
zpe.sumelectzpe: -611.483771 hartree
zpe.sumelectthermal: -611.468193 hartree
zpe.sumelectthermalent: -611.467249 hartree
zpe.sumelectthermalfe: -611.528822 hartree
dipole: -2.7579 6.1522 -1.7436
dipole: 6.9639
quadrupole: -61.0562 -92.0695 -81.2355
quadrupole: -0.9493 0.7635 3.7520
quadrupole: 17.0642 -13.9491 -3.1151 -0.9493 0.7635 3.7520
hfenergy: -611.7264764 hartree
pointgroup: C01 [X(C9H16N2O2)]
dipole: -1.1293464 -2.2547772 1.0709861 debye
polarizability: 147.5189353|5.700255|115.6850113|-18.7249693|-5.0821465|92.9685784 unknown
InChI: InChI=1S/C9H16N2O2/c1-3-5-7(6-4-2)8(12)11-9(10)13/h3,7,11H,1,4-6,10H2,2H3
charge 0 multiplicity 1
29 atoms
O  0.451112 1.367188 -1.32573
O  -1.284655 3.126245 0.362382
N  -1.029061 0.756369 0.389578
N  -3.078348 1.747974 0.933397
C  0.869286 -0.765194 -0.197724
C  2.251606 -0.403679 0.445542
C  0.163893 -1.853796 0.665801
C  3.268323 0.246867 -0.518678
C  0.085265 0.544087 -0.448461
C  4.596654 0.590099 0.189407
C  -1.203389 -2.29694 0.178908
C  -2.282354 -2.524819 0.973797
C  -1.76279 1.979767 0.528735
H  1.066688 -1.184631 -1.205001
H  2.689154 -1.340022 0.851542
H  2.083905 0.265037 1.314853
H  0.111661 -1.533661 1.726356
H  0.836192 -2.736815 0.652501
H  3.461976 -0.448433 -1.361047
H  2.824185 1.155312 -0.962161
H  5.317262 1.043566 -0.515086
H  5.069798 -0.311916 0.623571
H  4.431632 1.312431 1.011169
H  -1.295915 -2.457753 -0.906776
H  -1.399953 -0.065361 0.875836
H  -3.232895 -2.881136 0.561621
H  -2.232216 -2.399283 2.063925
H  -3.523282 0.833162 0.872429
H  -3.653037 2.566434 1.123411
