program: Gaussian 09
title: 000231342
version: EM64L-G09RevD.01
frameworkgroup: C1[X(C12H14O3)]
method: RPBEPBE
basis: SDD
operation: Freq
keyword: #pfreq=noraman
keyword: PBEPBE/SDD
title: #p freq=noraman PBEPBE/SDD
converged: YES YES NO NO
title: Mulliken charges:
elementType: O O O C C C C C C C C C C C C H H H H H H H H H H H H H H
charge: -0.264059 -0.238022 -0.228335 -0.563991 0.508439 -0.501280 -0.439269 -0.388013 0.294584 -0.340726 -0.360049 0.250194 0.125217 -0.791664 -0.505034 0.229123 0.241489 0.260930 0.260060 0.239547 0.237689 0.241045 0.276787 0.237045 0.237712 0.260563 0.241805 0.235359 0.242854
chargesum: 0.00000
title: Mulliken charges with hydrogens summed into heavy atoms:
elementType: O O O C C C C C C C C C C C C
charge: -0.264059 -0.238022 -0.228335 -0.093379 0.508439 0.019710 -0.199722 -0.150324 0.294584 -0.099680 -0.083262 0.250194 0.125217 -0.056344 0.214984
polarizability: 2.10203089e+02 -4.89484243e+00 1.26181919e+02 1.20764387e+01 5.57673902e+00 8.90294189e+01
1716.lowfreq: -8.6378 0.0006 0.0008 0.0010 2.2943 3.4584 17.8008 22.1159 40.6761
frequency: 16.0278 21.9969 40.6737 53.3779 66.6842 108.0932 116.7590 159.7585 161.2267 175.6832 192.2547 251.3666 298.2729 330.8229 360.8573 403.5706 411.9915 458.7673 507.0656 559.4384 560.4943 598.2313 633.2756 646.4291 694.1618 749.3523 778.3170 802.7942 834.2458 859.7795 876.6323 945.1015 948.6294 969.5081 999.0675 1004.6592 1010.3740 1027.5888 1051.2140 1072.4846 1113.4796 1114.0485 1134.5351 1148.4582 1157.8995 1190.4059 1221.4022 1264.7827 1274.0802 1283.8308 1310.5590 1352.9306 1368.2185 1383.4291 1410.8822 1423.0687 1443.4281 1448.7987 1454.1334 1463.5275 1463.8059 1478.3302 1500.7684 1564.5733 1598.0578 1621.6415 1644.9866 2985.7917 2995.8847 3005.3937 3008.3833 3052.7653 3070.3715 3077.6289 3107.3817 3121.1380 3124.5865 3125.9731 3151.1977 3152.5169 3158.0915
redmass: 5.9037 4.0963 5.5273 2.4924 3.8242 1.0966 4.3770 1.0358 5.3692 3.2161 3.7056 5.3898 4.4472 2.7275 4.6776 2.8466 4.1665 3.8641 3.3101 3.9594 3.2062 2.3461 6.8782 4.7099 3.9896 3.6615 1.4010 5.0976 1.7004 1.5137 2.5050 2.2296 4.6597 1.4168 1.3726 1.9368 2.8907 1.8218 4.4324 2.4781 1.3138 1.4111 2.1631 1.4399 1.3461 1.1261 2.3947 1.2272 3.7629 1.5218 1.3041 1.6401 1.2735 4.4614 3.2758 1.1902 1.0829 1.0970 1.0498 1.0499 1.0506 1.1055 2.5921 6.4509 7.4637 6.6014 9.0162 1.0374 1.0636 1.0302 1.0608 1.0966 1.0968 1.1011 1.1046 1.0892 1.0930 1.0944 1.1048 1.0946 1.0955
irintensity: 2.4543 0.7683 0.8846 0.4969 3.5386 0.3654 1.1348 0.4747 1.5692 8.5863 6.9061 6.3961 16.1459 4.1488 5.3666 0.0495 0.3832 3.5270 11.5568 3.2998 8.6162 18.4569 0.5803 14.1886 3.2426 0.4657 4.9000 3.8446 53.8050 4.2155 16.1255 38.7582 3.7072 0.4171 1.6349 2.8244 7.8407 0.8450 48.2492 1.4803 9.6102 39.4522 176.5618 9.1493 76.1428 29.8440 0.0631 18.5806 240.9742 67.3502 12.2806 23.1705 48.9139 10.3338 22.8593 24.3813 24.3906 29.1613 14.4717 20.2755 12.7906 12.0685 0.5952 69.3811 141.4009 33.6754 168.7164 3.5788 5.6560 32.9581 20.6573 0.0858 12.8607 15.7142 26.6477 12.5711 31.5830 0.6996 15.7253 17.7563 1.9946
temp: 298.150 k
press: 1.00000 atm
elementType: 8 8 8 6 6 6 6 6 6 6 6 6 6 6 6 1 1 1 1 1 1 1 1 1 1 1 1 1 1
symmnumber: 1
zpe: 608469.7 jmol-1
zpe.correction: 0.231754 hartree
zpe.thermalcorrener: 0.247419 hartree
zpe.thermalcorrenthalpy: 0.248363 hartree
zpe.thermalcorrgfe: 0.185347 hartree
zpe.sumelectzpe: -690.242655 hartree
zpe.sumelectthermal: -690.226990 hartree
zpe.sumelectthermalent: -690.226046 hartree
zpe.sumelectthermalfe: -690.289062 hartree
dipole: -2.6782 1.6506 1.5073
dipole: 3.4885
quadrupole: -89.4800 -88.5753 -90.0377
quadrupole: 20.5007 -2.8926 5.4517
quadrupole: -0.1156 0.7890 -0.6734 20.5007 -2.8926 5.4517
hfenergy: -690.4744091 hartree
pointgroup: C01 [X(C12H14O3)]
dipole: -1.0633337 0.8502945 0.1732237 debye
polarizability: 210.0918596|2.9893958|121.3581467|13.2786823|-13.5836505|93.9644208 unknown
InChI: InChI=1S/C12H14O3/c1-9(13)11-6-3-10(4-7-11)5-8-12(14)15-2/h3-4,6-7H,5,8H2,1-2H3
charge 0 multiplicity 1
29 atoms
O  -4.586959 -0.165901 1.137245
O  -4.339112 0.402504 -1.108299
O  4.766799 -1.119617 0.863845
C  -1.468746 0.004156 -0.959312
C  0.01345 0.003146 -0.621788
C  -2.342849 0.049452 0.320097
C  0.787113 1.187629 -0.724812
C  0.653882 -1.182317 -0.166543
C  2.788723 0.008462 0.076046
C  2.155429 1.194154 -0.381771
C  2.016763 -1.181966 0.177047
C  -3.827427 0.119775 -0.000924
C  4.242868 -0.041646 0.453006
C  5.080257 1.228705 0.333393
C  -6.059333 -0.091898 0.963335
H  -1.732914 -0.901556 -1.53678
H  -1.726038 0.868796 -1.595692
H  -2.157597 -0.82498 0.969266
H  -2.082773 0.938138 0.928525
H  0.311546 2.108823 -1.082596
H  0.075169 -2.111563 -0.092818
H  2.726627 2.123971 -0.475578
H  2.519666 -2.090638 0.524918
H  4.675783 2.033583 0.975236
H  5.086078 1.605412 -0.706425
H  6.112834 1.007121 0.642359
H  -6.357042 0.923115 0.650772
H  -6.470557 -0.339923 1.951581
H  -6.389944 -0.816437 0.200369
