program: Gaussian 09
title: 000231336
version: EM64L-G09RevD.01
frameworkgroup: C1[X(C14H16N4)]
method: RPBEPBE
basis: SDD
operation: Freq
keyword: #pfreq=noraman
keyword: PBEPBE/SDD
title: #p freq=noraman PBEPBE/SDD
converged: YES YES NO NO
title: Mulliken charges:
elementType: N N N N C C C C C C C C C C C C C C H H H H H H H H H H H H H H H H
charge: -0.395546 -0.086760 -0.136899 -0.594966 -0.442978 -0.536721 -0.488313 0.110534 0.054183 0.180486 -0.535572 -0.062474 0.493823 -0.369893 -0.452503 -0.231761 -0.218651 -0.243575 0.217985 0.226720 0.227167 0.214414 0.235241 0.232069 0.304783 0.271898 0.218952 0.254011 0.230230 0.325709 0.319815 0.225574 0.224956 0.228063
chargesum: 0.00000
title: Mulliken charges with hydrogens summed into heavy atoms:
elementType: N N N N C C C C C C C C C C C C C C
charge: -0.090763 -0.086760 -0.136899 0.050559 0.001727 -0.095141 -0.021004 0.110534 0.054183 0.180486 -0.044722 -0.062474 0.493823 -0.115882 -0.222273 -0.006187 0.006305 -0.015512
polarizability: 2.41604584e+02 -1.00839353e+01 1.63165425e+02 -1.46920686e+01 3.44156316e+00 1.37847392e+02
1716.lowfreq: -0.0003 -0.0002 0.0005 3.3417 5.1186 8.7894 15.5554 29.3829 35.5437
frequency: 13.9442 29.2340 35.4813 99.5229 118.5834 144.2487 166.3378 206.1721 215.3300 232.3968 276.7653 287.4885 316.4301 403.2158 409.2185 423.3498 462.6830 484.0360 508.7372 512.6809 522.9645 554.0150 576.1700 608.1831 617.7598 634.5168 687.2162 692.9929 706.0569 751.4078 761.8573 774.4229 806.8475 832.2169 856.0303 890.4753 904.6074 911.6665 947.4568 955.4726 978.4289 989.8066 995.0100 1001.2671 1025.3729 1026.5690 1042.8841 1077.4216 1083.9971 1110.8059 1129.5776 1171.4034 1181.7265 1185.7944 1191.2973 1202.7345 1211.3328 1237.6580 1271.1264 1275.5814 1307.0830 1313.9355 1321.2539 1347.5896 1380.5989 1385.6218 1416.1215 1441.7550 1453.7690 1463.2544 1465.2549 1470.2728 1479.5754 1483.2684 1488.7514 1565.5304 1578.1215 1594.9994 1605.6346 1614.6850 2951.7305 2977.0544 2988.7183 2997.6142 3015.0383 3044.3875 3060.2684 3080.1028 3112.3113 3123.6127 3135.7080 3146.5450 3162.5798 3565.6669 3573.3424 3726.8007
redmass: 4.4390 4.1446 4.7149 3.0512 2.6819 4.4391 2.8635 3.3648 4.2682 4.0212 3.2652 3.9717 3.3797 2.7146 2.4336 1.2087 4.1257 4.0693 1.2700 3.7139 1.1243 3.5812 3.8874 4.6758 6.0407 2.6033 3.5240 7.9082 1.8616 1.9131 4.1720 7.0552 3.7941 2.1552 1.2471 1.5244 2.7248 1.4312 3.2548 2.7538 1.3903 6.0493 1.4381 2.1964 2.2283 2.2077 1.7129 2.3762 1.7550 3.0102 1.2933 1.0546 2.1820 1.1301 1.6472 1.2963 2.6777 1.2552 1.8674 1.2908 1.5514 1.3888 2.9140 1.3935 4.2550 6.4842 2.3617 2.1298 1.2390 1.2348 1.2438 1.6710 1.2998 2.1355 2.3018 7.7790 2.9151 5.7538 1.8797 5.6502 1.0612 1.0636 1.0653 1.0926 1.0701 1.0971 1.0959 1.1041 1.0874 1.0859 1.0912 1.0960 1.1015 1.0438 1.0769 1.1059
irintensity: 0.0723 0.3131 0.1534 0.8101 0.6992 0.2983 6.5782 2.6793 0.1854 1.7440 3.3609 1.9470 6.8471 5.7297 14.1312 281.6609 1.9393 24.8948 99.0251 7.6478 1.7085 1.5888 14.3976 11.0251 2.5621 5.0200 4.1120 0.4051 45.3015 43.3642 14.2989 14.2103 7.0422 9.6705 0.1307 0.6016 2.1346 4.4105 7.7735 6.3480 0.2117 0.1604 0.6959 6.6544 12.5552 4.6534 0.3534 1.7082 23.6680 18.1201 1.7982 0.1089 3.6988 4.1389 12.4566 4.4974 3.9684 51.0452 18.3837 1.3148 7.5574 2.9304 15.4848 20.5315 10.7053 21.5594 58.5915 17.4537 35.5979 53.4907 10.6325 200.9290 20.6283 5.7502 14.2458 762.8528 162.0435 20.9383 440.2564 28.3809 50.3516 69.4874 30.4640 16.7909 58.4512 16.5748 22.5311 51.7260 9.7845 0.3641 16.4264 41.5965 24.6350 101.6676 29.9077 41.2864
temp: 298.150 k
press: 1.00000 atm
elementType: 7 7 7 7 6 6 6 6 6 6 6 6 6 6 6 6 6 6 1 1 1 1 1 1 1 1 1 1 1 1 1 1 1 1
symmnumber: 1
zpe: 733110.7 jmol-1
zpe.correction: 0.279227 hartree
zpe.thermalcorrener: 0.294832 hartree
zpe.thermalcorrenthalpy: 0.295776 hartree
zpe.thermalcorrgfe: 0.234213 hartree
zpe.sumelectzpe: -760.831934 hartree
zpe.sumelectthermal: -760.816329 hartree
zpe.sumelectthermalent: -760.815385 hartree
zpe.sumelectthermalfe: -760.876948 hartree
dipole: 1.3157 -1.2725 -0.6210
dipole: 1.9328
quadrupole: -103.6543 -95.4175 -101.4723
quadrupole: 1.0154 -1.1300 1.7148
quadrupole: -3.4729 4.7639 -1.2909 1.0154 -1.1300 1.7148
hfenergy: -761.1111612 hartree
pointgroup: C01 [X(C14H16N4)]
dipole: 0.5424348 0.4044014 0.3470966 debye
polarizability: 240.7152515|-0.1008868|160.6454614|21.0050149|5.9041585|141.2566882 unknown
InChI: InChI=1S/C14H16N4/c15-14-17-12-8-4-7-11(12)13(18-14)16-9-10-5-2-1-3-6-10/h1-3,5-6,16H,4,7-9,15H2
charge 0 multiplicity 1
34 atoms
N  0.314621 0.210707 1.075259
N  -3.327114 -0.808628 -0.790706
N  -1.077539 -1.383417 0.023262
N  -2.457289 -2.975408 -0.996308
C  -3.210577 2.866841 -0.16079
C  -1.964901 2.355186 0.645912
C  -4.081507 1.605493 -0.457322
C  -1.896097 0.889982 0.257431
C  -3.086041 0.463364 -0.362927
C  -0.884861 -0.095136 0.453667
C  1.398025 -0.758076 1.292674
C  -2.277567 -1.675631 -0.570235
C  2.679199 -0.412069 0.53729
C  2.634175 -0.098297 -0.846001
C  3.932972 -0.422808 1.19609
C  3.81964 0.193455 -1.554314
C  5.1230 -0.132198 0.488585
C  5.069608 0.177018 -0.889396
H  -3.768148 3.647118 0.385408
H  -2.86707 3.306628 -1.114826
H  -2.121408 2.476872 1.738364
H  -1.054224 2.93036 0.38506
H  -4.578541 1.641109 -1.442128
H  -4.877118 1.467228 0.301551
H  0.475349 1.182962 1.337516
H  0.995714 -1.729285 0.951038
H  1.616838 -0.846171 2.375524
H  1.666214 -0.08792 -1.36038
H  3.979334 -0.660096 2.266862
H  -3.335707 -3.224433 -1.441479
H  -1.715379 -3.654529 -0.857319
H  3.772472 0.430375 -2.623436
H  6.086238 -0.143308 1.011369
H  5.989785 0.404512 -1.439293
