program: Gaussian 09
title: 000231334
version: EM64L-G09RevD.01
frameworkgroup: C1[X(C8H11N3S)]
method: RPBEPBE
basis: SDD
operation: Freq
keyword: #p
keyword: freq=noraman
keyword: PBEPBE/SDD
title: #p freq=noraman PBEPBE/SDD
converged: NO YES NO NO
title: Mulliken charges:
elementType: S N N N C C C C C C C C H H H H H H H H H H H
charge: 0.202910 -0.061967 -0.046864 -0.592372 -0.438226 -0.533968 -0.492298 0.332592 0.028094 -0.367403 -0.068512 -0.822951 0.226854 0.226906 0.238335 0.238282 0.240424 0.240483 0.329489 0.324016 0.278083 0.239791 0.278305
chargesum: 0.00000
title: Mulliken charges with hydrogens summed into heavy atoms:
elementType: S N N N C C C C C C C C
charge: 0.202910 -0.061967 -0.046864 0.061132 0.015533 -0.057352 -0.011391 0.332592 0.028094 -0.367403 -0.068512 -0.026772
polarizability: 1.63199798e+02 1.70082861e+00 1.50361028e+02 -2.13901776e-02 3.99065480e-02 6.52030878e+01
1716.lowfreq: -109.5715 -0.0012 0.0011 0.0024 4.7906 7.3057 10.1852 63.4045 87.4613
frequency: -109.5652 63.4025 87.4553 105.4725 140.8777 161.1657 205.6247 232.2047 287.9244 305.9399 389.8865 440.1542 487.4966 498.7290 517.1784 544.6063 597.7387 648.6316 659.9550 703.2980 750.1100 773.9264 780.6987 871.6542 900.2127 903.2092 950.7490 977.3166 995.2138 1013.0888 1036.6293 1043.9346 1141.1525 1143.3227 1194.0109 1231.6669 1236.5386 1265.4530 1291.1125 1301.2907 1322.4394 1343.8968 1383.5969 1432.8304 1450.2184 1451.7394 1465.1698 1472.8090 1485.9874 1518.5835 1558.2284 1603.0251 2981.7567 3000.0844 3023.7008 3025.0031 3025.7351 3047.1305 3084.3584 3149.8452 3156.9649 3564.1221 3724.4526
redmass: 1.6063 3.3135 1.0928 2.7806 3.8664 4.6195 5.4577 3.9899 4.4717 3.2046 9.1010 1.2010 4.5032 5.4078 1.3333 2.2605 6.3760 5.6713 7.3382 6.3517 1.1440 8.1135 6.4994 8.1385 3.4708 1.5147 2.9207 1.1766 1.4558 2.7520 1.7389 2.3234 1.1999 6.0105 1.2054 1.2925 1.0703 3.3380 2.4700 1.6599 2.1427 1.3393 8.2159 1.0536 1.0683 1.1523 1.1681 2.5533 1.1349 5.3874 6.8477 1.5390 1.0595 1.0598 1.1028 1.0287 1.0614 1.1022 1.1047 1.1042 1.1057 1.0439 1.1059
irintensity: 0.3979 2.5749 0.1204 4.2067 1.9486 5.8525 0.4106 0.4579 0.8816 11.6745 1.1286 304.7912 1.3075 6.6410 0.6113 2.9673 0.6166 2.7159 1.6014 8.5037 11.3491 13.3745 0.5191 59.3513 2.8578 0.1946 0.0876 6.8604 6.8248 11.1177 0.3497 1.8383 0.0430 19.4630 0.0092 7.5339 0.0122 8.2565 57.4610 23.7178 9.5593 5.1163 54.3395 13.5975 33.3522 40.4526 4.7245 131.1610 18.1427 292.6765 203.5334 470.2530 26.2424 25.0207 11.8699 35.3625 52.1491 2.0191 46.7800 8.9622 11.5668 105.3253 42.8789
temp: 298.150 k
press: 1.00000 atm
elementType: 16 7 7 7 6 6 6 6 6 6 6 6 1 1 1 1 1 1 1 1 1 1 1
symmnumber: 1
zpe: 479407.7 jmol-1
zpe.correction: 0.182597 hartree
zpe.thermalcorrener: 0.193758 hartree
zpe.thermalcorrenthalpy: 0.194702 hartree
zpe.thermalcorrgfe: 0.145131 hartree
zpe.sumelectzpe: -872.892985 hartree
zpe.sumelectthermal: -872.881823 hartree
zpe.sumelectthermalent: -872.880879 hartree
zpe.sumelectthermalfe: -872.930451 hartree
dipole: -0.4935 0.7151 -0.0060
dipole: 0.8689
quadrupole: -68.2922 -70.3037 -80.1338
quadrupole: -7.0964 -0.0073 -0.0844
quadrupole: 4.6177 2.6062 -7.2239 -7.0964 -0.0073 -0.0844
hfenergy: -873.0755816 hartree
pointgroup: C01 [X(C8H11N3S1)]
dipole: -0.2495059 0.2335077 0.0094611 debye
dipolederiv: -0.3406169 -0.3102483 0.0128002 -0.4797281 -0.4520971 0.0271545 0.0115029 0.0164995 -0.119492 -0.8116605 0.6715922 0.0260183 -0.027571 -0.8534629 0.0047738 0.0290712 -0.0316459 -0.2555462 -0.4856002 -0.0511512 0.0149864 0.1843195 -1.4400097 -0.0037719 0.0134948 0.0074693 -0.1944444 -0.5207779 0.6940273 -0.0119081 0.6052972 -1.3072577 -0.0306149 -0.0081694 -0.0418596 -0.7256062 0.1203594 -0.0371972 0.0019984 -0.0598332 0.0194537 0.003777 0.0018356 0.0027026 0.1526421 0.067452 -0.0113276 0.0060832 0.0423604 0.0194951 -0.0010972 0.0051723 0.0018774 0.1828159 -0.2231645 0.0691466 0.0175914 -0.0904423 0.0342269 0.0051718 0.0184253 -0.0032331 0.1237752 -0.8583918 -0.4739027 0.0463717 -0.6092925 -0.4322769 0.0333301 0.0482016 0.0262864 -0.012198 0.7391574 -0.1770047 -0.0365921 0.4041907 0.8349758 -0.0249308 -0.0394126 0.0054591 0.0164221 1.0075733 0.5207114 -0.0540739 0.5411222 1.2231417 -0.0341299 -0.0535327 -0.032121 -0.0007821 0.779172 -0.7753233 -0.0268902 -0.6518073 1.7695749 0.0276397 -0.0282604 0.0351197 0.2113409 0.2038243 0.0135867 -0.00874 0.0151778 0.0096947 -0.0005234 -0.0077164 0.0005239 0.056826 -0.0487614 0.0446338 -0.0908713 0.0466863 0.0374593 0.0428053 -0.1523076 0.0676782 -0.0506184 -0.0232548 0.0380092 0.08762 0.0432434 0.0362599 -0.0484485 0.1490226 -0.0730318 -0.0748138 0.0235486 0.0112576 0.023036 0.0271185 -0.0350232 0.0925213 -0.001811 0.1343132 -0.0493347 0.0208569 -0.0034101 -0.0303677 0.0171162 -0.0380388 -0.0950462 -0.0055138 -0.134833 -0.0430156 0.0153781 -0.032217 0.0553627 -0.0037963 0.0104343 0.072144 0.1044369 0.094146 -0.0422649 -0.0016265 -0.042335 -0.0590353 -0.0121296 0.0087378 -0.0717602 -0.1085218 -0.0907313 -0.0236441 0.153654 -0.0042557 0.0121683 -0.0330042 0.2743565 0.0029881 0.011478 0.0042534 0.3857933 0.2039113 -0.0797354 0.0086032 -0.0424782 0.2029732 0.0029846 0.0064866 0.0076473 0.3825474 0.0003058 0.0118076 0.0200035 0.0961253 0.0593056 -0.1016307 0.0192861 -0.0679266 -0.0248495 -0.0181212 -0.0967386 0.0080756 -0.1198729 -0.0416265 0.0065976 0.0083322 0.0055439 0.1240128 -0.0032175 0.0200746 -0.0222403 0.1071981 0.0597038 0.0900659 -0.0215004 0.0658624 -0.0195658 unknown
polarizability: 161.6403894|4.1918362|151.6501162|-5.0877706|-0.6288768|65.4734081 unknown
InChI: InChI=1S/C8H11N3S/c1-12-7-5-3-2-4-6(5)10-8(9)11-7/h2-4,9H2,1H3
charge 0 multiplicity 1
23 atoms
S  -1.713724 -2.220818 0.188055
N  0.595974 1.794338 0.050189
N  -1.504683 0.527922 0.165192
N  -1.486644 2.873509 0.155181
C  2.999089 -1.096485 -0.059012
C  1.593183 -1.803779 0.018599
C  2.753156 0.450863 -0.053833
C  0.606077 -0.659814 0.062378
C  1.247355 0.599633 0.022724
C  -0.806663 -0.637201 0.134794
C  -0.77541 1.693802 0.121897
C  -3.488628 -1.603136 0.287526
H  3.627685 -1.394369 0.797473
H  3.534345 -1.40311 -0.973848
H  1.509692 -2.448329 0.914813
H  1.417536 -2.460661 -0.854936
H  3.14195 0.945177 -0.963216
H  3.233094 0.954073 0.805764
H  -0.977917 3.752314 0.120486
H  -2.500707 2.844014 0.201679
H  -3.616865 -0.998339 1.195649
H  -4.112797 -2.509545 0.322385
H  -3.7180 -0.997657 -0.599941
