program: Gaussian 09
title: 000231329
version: EM64L-G09RevD.01
frameworkgroup: C1[X(C13H19N5O)]
method: RPBEPBE
basis: SDD
operation: Freq
keyword: #p
keyword: freq=noraman
keyword: PBEPBE/SDD
title: #p freq=noraman PBEPBE/SDD
converged: YES YES NO NO
title: Mulliken charges:
elementType: O N N N N N C C C C C C C C C C C C C H H H H H H H H H H H H H H H H H H H
charge: -0.465940 -0.217054 -0.086765 -0.203229 -0.132583 -0.111970 -0.062649 -0.084124 -0.426672 -0.433058 -0.414036 -0.390442 0.238090 -0.247149 -0.097560 0.243656 -0.351256 -0.646010 -0.626899 0.251789 0.182641 0.204659 0.213087 0.211520 0.225558 0.205225 0.198040 0.206927 0.191383 0.277834 0.390802 0.250874 0.318414 0.222327 0.221809 0.297671 0.222381 0.222709
chargesum: 0.00000
title: Mulliken charges with hydrogens summed into heavy atoms:
elementType: O N N N N N C C C C C C C C C C C C C
charge: -0.075139 -0.217054 -0.086765 -0.203229 -0.132583 -0.111970 0.189140 0.098517 -0.008925 0.004020 -0.010771 0.007867 0.238090 0.030685 -0.097560 0.243656 -0.100382 0.116541 0.115862
polarizability: 2.71861784e+02 -1.55337750e+00 1.76943613e+02 5.18286033e+00 -3.35128681e+00 1.06161857e+02
1716.lowfreq: -6.0421 -0.0009 0.0000 0.0003 5.4263 6.9805 23.1153 42.9751 81.6069
frequency: 22.6660 42.9605 81.5927 90.7258 124.0771 127.1466 139.6949 161.8207 179.9684 221.3977 234.5610 243.0391 265.1401 296.4873 314.1106 333.0114 374.3486 382.0147 386.7008 422.5434 437.8057 452.4442 505.9194 542.6614 549.4245 590.3699 614.2983 638.6676 658.7519 677.4142 743.3666 781.1465 784.6875 809.9381 848.4591 856.4233 870.9702 888.1029 894.6808 900.5028 930.1369 945.4761 958.4683 1014.0695 1031.6667 1048.2646 1063.5777 1065.5592 1096.7260 1098.4833 1112.0642 1117.3491 1128.6937 1150.0422 1153.7230 1183.4524 1198.4428 1207.5169 1240.7022 1241.7114 1243.1208 1269.1084 1290.4710 1297.2078 1299.2140 1314.2404 1325.6436 1338.7006 1339.3714 1342.3866 1354.4949 1362.2061 1371.2473 1389.6518 1409.6271 1428.6580 1445.3487 1461.4836 1463.6905 1466.8030 1474.9550 1477.4150 1480.2447 1485.8728 1499.9225 1506.1434 1531.4658 1533.3587 1601.9209 2838.8317 2901.5397 2958.6734 2965.8416 2969.9193 2972.5663 2977.2332 2985.4759 2994.3947 3030.4907 3034.0687 3038.4925 3043.2000 3046.3342 3064.2848 3099.9889 3130.2127 3165.6166 3269.9997
redmass: 4.8959 3.9550 2.8010 3.0560 1.2885 3.8884 1.7353 1.9753 2.7633 5.0048 3.5748 3.7456 3.7398 4.5296 4.1341 1.7494 3.1887 3.0931 4.0700 3.8673 3.3478 3.9486 4.5253 2.2829 3.3682 5.9379 6.2276 4.6646 9.8642 7.0325 2.8858 4.5064 2.4596 1.6499 1.7976 4.7844 1.7443 1.2053 2.4639 3.2750 1.4121 2.0689 2.4385 3.6037 2.7422 2.0487 1.5274 1.5163 4.5516 1.2148 2.6301 2.4147 2.5761 1.3671 2.2679 2.0688 2.4929 1.5877 1.3330 1.8284 2.1990 1.8891 1.3252 1.3110 3.0024 1.4666 1.4698 2.0323 1.5085 1.4773 2.1217 1.5169 4.8215 1.7766 1.2263 2.9260 1.3999 1.3019 1.0857 1.0942 1.0813 1.2283 1.1024 1.0463 1.0504 1.9528 1.3383 5.0078 4.9670 1.0754 1.0819 1.0350 1.0606 1.0365 1.0646 1.0627 1.0817 1.0648 1.1000 1.1007 1.0962 1.1014 1.1019 1.1009 1.1020 1.0971 1.0925 1.0973
irintensity: 1.8572 0.6720 0.1745 0.3936 1.0713 3.5171 5.0368 1.1755 1.0909 2.4221 2.8957 2.1402 1.1244 0.6919 1.1098 0.3233 5.8120 13.6585 2.2250 0.7972 7.7306 2.7613 1.3000 6.5034 0.3142 3.1443 2.9336 16.7021 4.1338 15.7414 10.6635 9.3678 5.1904 11.5477 13.8304 5.6148 13.5075 107.5600 0.5522 11.2042 2.2540 23.1836 6.0468 105.1978 30.2762 4.8732 0.0464 10.3404 6.7165 0.0098 5.6161 7.5536 7.8739 0.0136 83.7000 93.1790 18.3738 34.0018 4.1334 8.7501 1.2679 4.7743 9.9863 10.5839 69.3372 2.6042 1.4600 6.5570 3.3903 13.5271 30.2094 41.2419 93.0783 5.4690 21.8158 11.8987 2.4962 1.3518 7.5487 5.9651 23.3476 35.0951 0.4823 3.7436 34.6324 114.6988 58.0038 111.0497 641.6172 1434.0813 114.8612 84.1667 41.0686 144.9571 31.3149 32.3085 11.5263 26.4178 42.0567 43.8341 56.5860 27.5854 60.3373 46.0857 10.0764 0.9731 15.3290 0.1720
temp: 298.150 k
press: 1.00000 atm
elementType: 8 7 7 7 7 7 6 6 6 6 6 6 6 6 6 6 6 6 6 1 1 1 1 1 1 1 1 1 1 1 1 1 1 1 1 1 1 1
symmnumber: 1
zpe: 830012.8 jmol-1
zpe.correction: 0.316135 hartree
zpe.thermalcorrener: 0.333264 hartree
zpe.thermalcorrenthalpy: 0.334208 hartree
zpe.thermalcorrgfe: 0.270974 hartree
zpe.sumelectzpe: -854.343754 hartree
zpe.sumelectthermal: -854.326626 hartree
zpe.sumelectthermalent: -854.325682 hartree
zpe.sumelectthermalfe: -854.388916 hartree
dipole: 1.0748 -3.9204 0.1195
dipole: 4.0668
quadrupole: -93.5845 -120.5867 -113.5167
quadrupole: 7.2101 1.3560 0.5466
quadrupole: 15.6448 -11.3574 -4.2874 7.2101 1.3560 0.5466
hfenergy: -854.6598896 hartree
pointgroup: C01 [X(C13H19N5O1)]
dipole: -0.4072184 1.3660015 -0.7267908 debye
polarizability: 270.172737|-10.5738424|161.8802616|-13.8306758|-28.7801601|122.9142551 unknown
InChI: InChI=1S/C13H19N5O/c1-17(2)12-11-13(15-7-14-12)18(8-16-11)9-5-3-4-6-10(9)19/h7-10,19H,3-6H2,1-2H3
charge 0 multiplicity 1
38 atoms
O  2.205398 -1.996142 1.016868
N  0.713935 0.354603 -0.500225
N  -1.158562 1.660645 -0.811626
N  -0.362419 -1.577703 0.639167
N  -3.995741 0.577149 0.193885
N  -2.770344 -1.308625 0.905996
C  2.149296 -0.098716 -0.632738
C  2.723094 -0.674789 0.710379
C  2.989626 1.080877 -1.188452
C  4.25394 -0.875772 0.632498
C  4.493248 0.747777 -1.275931
C  5.033253 0.346028 0.111581
C  -0.374084 -0.354398 0.027233
C  0.168283 1.556196 -0.988424
C  -1.527595 0.459315 -0.171948
C  -2.78565 -0.06306 0.298359
C  -1.600759 -1.979898 1.044669
C  -4.161702 1.903954 -0.426285
C  -5.228541 -0.042228 0.712992
H  2.159971 -0.938252 -1.35903
H  2.480151 0.063802 1.512155
H  2.866449 1.960303 -0.523022
H  2.613062 1.367257 -2.189642
H  4.430462 -1.743331 -0.033549
H  4.593196 -1.179611 1.639027
H  5.034799 1.626336 -1.675129
H  4.656563 -0.085197 -1.989546
H  6.111763 0.106596 0.053752
H  4.930678 1.201231 0.811158
H  0.771283 2.323999 -1.459983
H  1.177623 -2.000269 0.96589
H  -1.656392 -2.952566 1.541396
H  -3.195256 2.285741 -0.786265
H  -4.581839 2.613584 0.313188
H  -4.868837 1.834027 -1.275757
H  -4.980135 -1.021415 1.144669
H  -5.961698 -0.169846 -0.106569
H  -5.679512 0.605097 1.48966
