program: Gaussian 09
title: 000231327
version: EM64L-G09RevD.01
frameworkgroup: C1[X(C11H16O2)]
method: RPBEPBE
basis: SDD
operation: Freq
keyword: #pfreq=noraman
keyword: PBEPBE/SDD
title: #p freq=noraman PBEPBE/SDD
converged: NO YES NO NO
title: Mulliken charges:
elementType: O O C C C C C C C C C C C H H H H H H H H H H H H H H H H
charge: -0.229380 -0.215503 -0.361461 -0.369655 -0.351750 -0.502476 -0.356318 0.123348 -0.695818 0.215589 -0.346535 -0.254428 -0.158384 0.185023 0.185064 0.215664 0.215720 0.189568 0.189614 0.245191 0.245175 0.193698 0.193683 0.210260 0.214569 0.210269 0.284513 0.259567 0.265190
chargesum: 0.00000
title: Mulliken charges with hydrogens summed into heavy atoms:
elementType: O O C C C C C C C C C C C
charge: -0.229380 -0.215503 0.008626 0.061729 0.027433 -0.012110 0.031063 0.123348 -0.060721 0.215589 -0.062021 0.005139 0.106806
polarizability: 1.76462711e+02 -1.11433508e+01 1.21650076e+02 -1.38272545e-02 -5.00990196e-03 7.79481852e+01
1716.lowfreq: -0.0009 0.0004 0.0009 5.1123 8.2825 13.6401 24.8227 39.2572 51.5425
frequency: 24.7609 39.0498 51.5380 69.1200 87.9564 117.1852 125.1793 141.5652 179.6710 201.9918 233.7977 239.8880 328.4315 419.1812 434.5614 497.0308 512.2701 589.0321 641.2045 719.5567 734.3056 742.6655 751.8823 791.9523 842.1483 863.2780 869.9514 876.2347 891.1335 906.2596 977.8102 980.6093 1008.1413 1013.6135 1041.8742 1061.2395 1072.3670 1084.3448 1097.9966 1119.8494 1133.7089 1190.2369 1190.8320 1220.5228 1238.2250 1251.4330 1278.3846 1289.3967 1293.2110 1294.4342 1333.9567 1356.8669 1361.3402 1367.6821 1389.0050 1426.0106 1458.5666 1461.4887 1463.9541 1471.5714 1476.6930 1480.4712 1487.9567 1558.6489 1580.0199 2947.4662 2954.7175 2965.4523 2966.6231 2969.3784 2985.0928 2992.4140 3001.2425 3009.1090 3028.0737 3055.8454 3066.1514 3068.5220 3223.7183 3242.5441 3262.4064
redmass: 2.3253 2.4550 4.3883 3.5041 2.0340 2.3378 4.1772 2.0172 4.8517 5.0323 1.1073 3.9416 4.3139 4.2051 3.5843 4.7439 2.8167 3.0249 3.2608 1.0927 1.1481 6.1110 1.2576 1.2856 1.2953 5.7434 5.2287 1.3349 1.9308 1.3875 1.2367 3.1926 1.9810 2.5376 3.4813 2.8851 2.4755 2.0808 1.4045 2.6065 1.6264 2.1633 1.6571 1.4359 1.3240 1.7323 1.1043 1.1019 1.6093 1.0899 1.5874 1.6452 1.8063 2.5312 1.2181 1.1088 4.8685 1.0729 1.0761 1.0742 1.0425 1.0796 1.0845 6.6713 8.5911 1.0591 1.0589 1.0590 1.0604 1.0367 1.0979 1.0600 1.1007 1.0977 1.1042 1.1032 1.1008 1.0993 1.0911 1.0989 1.1095
irintensity: 0.0861 0.0157 0.8404 1.5678 3.3192 1.0678 1.2230 0.2076 1.5417 5.0932 0.0076 2.6300 2.9960 2.7513 2.4405 6.1599 0.5190 9.5581 0.2326 15.7628 0.0890 10.5684 84.9536 9.4427 18.9289 36.2407 1.2981 0.0760 6.6767 1.4773 1.4480 28.4106 39.0027 11.8388 10.2746 19.5548 0.3234 0.8129 0.0020 9.4001 14.9423 4.3717 0.0912 6.2395 0.0038 53.8954 0.0085 0.0021 41.4549 0.6100 16.2468 4.6945 1.5523 14.6441 10.7669 21.1109 96.0721 0.2386 0.9763 2.5659 12.3197 4.9252 21.3706 119.8906 83.7583 7.1504 9.3664 77.7498 33.5778 32.5219 2.5152 32.5745 2.7782 3.4325 38.1198 58.1148 107.0057 54.6213 1.8370 0.7632 0.4370
temp: 298.150 k
press: 1.00000 atm
elementType: 8 8 6 6 6 6 6 6 6 6 6 6 6 1 1 1 1 1 1 1 1 1 1 1 1 1 1 1 1
symmnumber: 1
zpe: 641042.9 jmol-1
zpe.correction: 0.244160 hartree
zpe.thermalcorrener: 0.258424 hartree
zpe.thermalcorrenthalpy: 0.259368 hartree
zpe.thermalcorrgfe: 0.200632 hartree
zpe.sumelectzpe: -578.188948 hartree
zpe.sumelectthermal: -578.174684 hartree
zpe.sumelectthermalent: -578.173740 hartree
zpe.sumelectthermalfe: -578.232477 hartree
dipole: 1.8711 -2.7635 0.0000
dipole: 3.3374
quadrupole: -61.5761 -83.1225 -79.7440
quadrupole: -4.5308 -0.0053 0.0001
quadrupole: 13.2381 -8.3083 -4.9298 -4.5308 -0.0053 0.0001
hfenergy: -578.4331084 hartree
pointgroup: C01 [X(C11H16O2)]
dipole: -0.7345272 -1.0882727 -0.0118724 debye
polarizability: 176.4289055|11.2263122|121.6780879|0.0272625|0.4988194|77.9539784 unknown
InChI: InChI=1S/C11H16O2/c1-2-3-4-5-7-10(12)11-8-6-9-13-11/h6,8-9H,2-5,7H2,1H3
charge 0 multiplicity 1
29 atoms
O  -2.643793 -1.220265 -0.009329
O  -1.011718 2.037826 0.026786
C  2.581722 -0.477742 -0.006377
C  1.401442 0.518045 0.006424
C  3.959062 0.222597 0.001344
C  0.035789 -0.19021 -0.000799
C  5.148121 -0.764526 -0.010699
C  -1.14852 0.776154 0.01227
C  6.519708 -0.055461 -0.002691
C  -2.503765 0.195124 0.007075
C  -3.771456 0.77407 0.015427
C  -4.735725 -0.295921 0.004111
C  -4.017845 -1.485197 -0.010695
H  2.510398 -1.15139 0.874007
H  2.509311 -1.12978 -0.902802
H  1.469436 1.172297 0.896844
H  1.467927 1.193341 -0.868245
H  4.03397 0.874507 0.89695
H  4.033275 0.895584 -0.87858
H  -0.065435 -0.84912 -0.888151
H  -0.063511 -0.870672 0.870347
H  5.072652 -1.415423 -0.90608
H  5.073115 -1.436401 0.869089
H  6.632879 0.577997 0.897716
H  7.352185 -0.783303 -0.011287
H  6.632588 0.598752 -0.888163
H  -3.966287 1.844226 0.028256
H  -5.819664 -0.200012 0.006585
H  -4.297461 -2.535698 -0.022633
