program: Gaussian 09
title: 000231315
version: EM64L-G09RevD.01
frameworkgroup: C1[X(C12H16N2O2)]
method: RPBEPBE
basis: SDD
operation: Freq
keyword: #p
keyword: freq=noraman
keyword: PBEPBE/SDD
title: #p freq=noraman PBEPBE/SDD
converged: YES YES NO NO
title: Mulliken charges:
elementType: O O N N C C C C C C C C C C C C H H H H H H H H H H H H H H H H
charge: -0.186048 -0.217889 -0.439784 -0.648655 -0.346955 -0.403417 -0.351628 0.412506 0.208303 -0.692916 -0.374667 -0.434278 -0.236725 -0.224803 -0.245340 0.269146 0.241421 0.201539 0.250842 0.214105 0.190069 0.210118 0.214925 0.215584 0.245809 0.242369 0.328621 0.231366 0.232077 0.233381 0.346287 0.314634
chargesum: 0.00000
title: Mulliken charges with hydrogens summed into heavy atoms:
elementType: O O N N C C C C C C C C C C C C
charge: -0.186048 -0.217889 -0.111163 0.012267 -0.105534 0.048964 0.052546 0.412506 0.208303 -0.052288 -0.128858 -0.191909 -0.005359 0.007274 -0.011958 0.269146
polarizability: 1.43318092e+02 -4.91867828e+00 1.77036953e+02 2.14595583e+00 -3.16303992e-01 1.19103695e+02
1716.lowfreq: -12.6333 -6.0821 -2.1146 -0.0010 -0.0007 -0.0007 15.2305 33.7363 35.6591
frequency: 14.8647 33.6809 35.6038 54.0044 68.4456 72.5939 87.2095 133.5312 172.7282 204.2658 232.2704 240.3809 267.1214 299.1651 342.3638 392.5762 403.2291 431.4245 447.9305 503.1484 542.9026 548.7299 573.6579 615.0089 633.8291 644.3753 706.2690 717.9544 733.4198 749.0489 784.3986 797.5745 859.3396 880.9406 895.4972 912.6423 920.8654 947.8798 980.7683 989.4192 998.8976 1020.3863 1035.6961 1056.3496 1062.1314 1072.8238 1107.5458 1118.4000 1166.7463 1173.5521 1189.3898 1197.7157 1218.4168 1231.1290 1280.4773 1293.0676 1296.6152 1301.1398 1337.0552 1349.8680 1378.8530 1390.3936 1437.4215 1439.7507 1467.5442 1474.6999 1476.8814 1480.9405 1487.1592 1587.5347 1607.6171 1608.8847 1641.6248 1697.3639 2953.1834 2964.8909 2974.0152 2989.6826 3013.7054 3057.2855 3071.5959 3074.5483 3118.9714 3122.0663 3136.4614 3147.0011 3165.1665 3485.4853 3529.6700 3685.6286
redmass: 5.5462 5.3563 4.5269 3.6147 4.0856 1.8212 3.9220 4.1746 4.7179 3.1768 1.3318 3.1301 4.0155 3.0504 7.4781 1.5901 2.8191 2.2566 3.3097 4.1789 3.4813 1.1965 3.6644 6.0431 4.1270 1.1757 1.9242 6.1724 1.2626 2.5439 2.3048 2.9948 1.2464 1.7794 2.0987 2.1838 1.5891 4.1977 1.3995 5.7398 1.3199 2.4652 2.1382 1.9655 2.0000 1.8817 2.1716 1.9386 2.7301 1.0633 1.1209 1.8473 1.5725 1.2986 1.3009 2.4898 1.5213 1.3360 1.3005 1.5666 7.0171 1.2116 2.0940 2.1451 1.0764 1.0713 1.0482 2.1736 1.0817 5.9062 1.2780 4.5620 5.5117 7.1758 1.0807 1.0603 1.0363 1.0629 1.0983 1.1001 1.1006 1.0996 1.0873 1.0868 1.0910 1.0959 1.1014 1.0762 1.0458 1.1041
irintensity: 11.7491 2.4044 2.3928 0.1121 1.2159 0.1981 2.6159 3.0412 0.8794 0.0729 0.2021 0.7115 2.2248 0.4241 6.2203 43.2997 0.1486 40.8755 5.2089 8.4492 57.3799 185.1829 4.6575 0.0801 6.7996 61.9106 45.1449 40.0721 24.0267 25.3313 2.5501 5.1786 0.7352 3.5968 1.3163 21.0489 2.2565 14.1099 0.2821 0.2274 0.0879 10.2216 0.6892 9.7462 7.9308 7.8626 0.9458 12.7537 182.4433 1.0098 0.2261 0.0225 2.6962 4.6875 7.1683 121.4665 17.3013 9.4456 0.5980 1.6174 0.3216 11.6157 689.5611 87.0829 2.0732 2.6706 14.9742 15.7234 16.0427 3.3169 50.9231 22.8237 47.2888 426.5059 10.2505 24.0341 34.9424 30.1625 9.6774 4.5333 77.9585 46.5701 6.8043 2.6668 7.4195 32.0675 20.7817 45.8775 37.0046 35.0399
temp: 298.150 k
press: 1.00000 atm
elementType: 8 8 7 7 6 6 6 6 6 6 6 6 6 6 6 6 1 1 1 1 1 1 1 1 1 1 1 1 1 1 1 1
symmnumber: 1
zpe: 688118.9 jmol-1
zpe.correction: 0.262091 hartree
zpe.thermalcorrener: 0.278665 hartree
zpe.thermalcorrenthalpy: 0.279610 hartree
zpe.thermalcorrgfe: 0.214911 hartree
zpe.sumelectzpe: -725.662429 hartree
zpe.sumelectthermal: -725.645854 hartree
zpe.sumelectthermalent: -725.644910 hartree
zpe.sumelectthermalfe: -725.709608 hartree
dipole: -2.1145 7.0679 -0.2771
dipole: 7.3827
quadrupole: -99.3972 -98.8853 -90.0004
quadrupole: 19.5808 2.4631 2.7579
quadrupole: -3.3029 -2.7910 6.0939 19.5808 2.4631 2.7579
hfenergy: -725.9245192 hartree
pointgroup: C01 [X(C12H16N2O2)]
dipole: -2.015129 -2.0235774 0.529988 debye
polarizability: 154.1392086|15.924171|164.782563|-6.8399788|-6.4640145|120.5369679 unknown
InChI: InChI=1S/C12H16N2O2/c1-2-6-10(11(15)14-12(13)16)9-7-4-3-5-8-9/h3-5,7-8,10,14H,2,6,13H2,1H3
charge 0 multiplicity 1
32 atoms
O  2.416538 1.851511 -0.602118
O  4.464401 -0.18434 0.079577
N  2.088906 -0.318745 0.242227
N  3.395683 -2.256122 0.115113
C  0.236967 1.323575 0.447611
C  -0.330804 2.542425 -0.329455
C  -1.571332 3.164207 0.346212
C  -0.700526 0.116036 0.43511
C  1.684643 0.99995 -0.045529
C  -2.129215 4.364167 -0.44931
C  -1.07088 -0.502596 -0.791261
C  -1.228681 -0.412041 1.641813
C  -1.944516 -1.611035 -0.807327
C  -2.106137 -1.521892 1.629668
C  -2.466919 -2.125754 0.404053
C  3.410131 -0.860394 0.12624
H  0.371495 1.638679 1.505699
H  -0.583768 2.236218 -1.363936
H  0.47423 3.29479 -0.418345
H  -2.363106 2.397779 0.462907
H  -1.300194 3.494138 1.37064
H  -2.442714 4.054372 -1.464163
H  -1.365391 5.156233 -0.562778
H  -3.007013 4.809271 0.053913
H  -0.673687 -0.111039 -1.735767
H  -0.958961 0.057022 2.59634
H  1.351623 -0.935776 0.597989
H  -2.221577 -2.072523 -1.761931
H  -2.508986 -1.908584 2.57244
H  -3.149035 -2.982963 0.390557
H  4.299833 -2.723228 0.097443
H  2.552392 -2.807742 -0.033631
