program: Gaussian 09
title: 000231313
version: EM64L-G09RevD.01
frameworkgroup: C1[X(C7H13NO)]
method: RPBEPBE
basis: SDD
operation: Freq
keyword: #p
keyword: freq=noraman
keyword: PBEPBE/SDD
title: #p freq=noraman PBEPBE/SDD
converged: YES YES NO NO
title: Mulliken charges:
elementType: O N C C C C C C C H H H H H H H H H H H H H
charge: -0.444323 -0.085076 -0.113616 -0.140696 -0.475686 -0.456131 0.112730 -0.721215 -0.729883 0.231966 0.251701 0.206829 0.227846 0.212613 0.215036 0.212284 0.208558 0.238985 0.214273 0.255890 0.215375 0.362539
chargesum: 0.00000
title: Mulliken charges with hydrogens summed into heavy atoms:
elementType: O N C C C C C C C
charge: -0.081784 -0.085076 0.118350 0.111005 -0.041011 -0.028482 0.112730 -0.061387 -0.044346
polarizability: 9.93431340e+01 -4.70410320e+00 8.81309552e+01 5.26340595e-01 -1.27846476e-01 6.55176701e+01
1716.lowfreq: -13.4464 -1.5999 -0.0009 -0.0008 -0.0006 10.7494 62.5739 168.7729 174.0976
frequency: 62.5316 168.7689 174.0792 188.6521 212.5986 215.1659 263.2314 287.4930 362.8981 402.0870 434.5389 499.3313 546.3810 596.9273 643.4380 747.1499 806.4239 849.7793 874.1048 916.0978 928.6080 970.0397 980.3419 1007.2824 1046.3298 1082.6919 1117.4003 1138.8827 1162.9578 1194.7544 1202.0549 1253.2959 1272.2553 1279.1439 1299.7046 1300.3964 1311.2631 1327.1280 1381.7363 1387.7776 1465.5602 1468.4252 1474.8254 1478.1405 1479.5840 1487.5960 1626.4404 2949.6603 2981.7366 2982.2061 2991.2083 2992.4271 3016.0875 3057.7840 3068.3436 3074.1126 3076.6121 3091.9761 3102.2279 3568.1525
redmass: 2.9545 2.8409 2.1387 2.3054 1.0944 1.3381 4.1544 2.8910 2.1955 1.4909 1.8029 4.0059 3.2944 2.8121 4.2261 2.7182 1.9558 6.4821 2.2775 1.8910 1.3623 1.5709 1.9106 1.4360 1.4647 2.0026 1.7347 2.1954 1.6883 1.9124 1.4648 1.8239 1.2542 1.2795 1.4091 1.3566 1.4227 1.8864 1.1953 1.2052 1.0682 1.0494 1.0644 1.0681 1.0726 1.0513 8.8436 1.0823 1.0358 1.0369 1.0626 1.0638 1.0832 1.0989 1.1034 1.1000 1.1002 1.0994 1.0993 1.0675
irintensity: 0.0841 0.3449 0.4306 0.1231 0.1299 0.3057 3.3712 4.5446 11.4771 78.4202 53.5972 4.6411 2.4925 3.4780 4.7101 1.3102 8.5269 94.6849 30.8481 4.2811 5.7140 7.4086 18.8113 1.4993 0.7284 6.8193 3.6770 1.4720 8.0189 22.7753 6.7997 2.5894 14.5496 1.4553 16.0861 0.7118 1.2630 15.1153 17.4672 12.1023 5.4034 7.9700 16.0567 5.9387 6.8224 14.6698 2.6363 13.8971 30.2839 23.9689 32.4281 42.6077 16.8865 30.1024 31.1214 53.9940 57.6644 23.6170 15.7166 30.6744
temp: 298.150 k
press: 1.00000 atm
elementType: 8 7 6 6 6 6 6 6 6 1 1 1 1 1 1 1 1 1 1 1 1 1
symmnumber: 1
zpe: 498417.1 jmol-1
zpe.correction: 0.189837 hartree
zpe.thermalcorrener: 0.199702 hartree
zpe.thermalcorrenthalpy: 0.200646 hartree
zpe.thermalcorrgfe: 0.155458 hartree
zpe.sumelectzpe: -403.745651 hartree
zpe.sumelectthermal: -403.735786 hartree
zpe.sumelectthermalent: -403.734842 hartree
zpe.sumelectthermalfe: -403.780030 hartree
dipole: -0.7799 0.5692 -0.0927
dipole: 0.9699
quadrupole: -51.8289 -54.9694 -55.4805
quadrupole: -2.3884 0.6072 -0.0641
quadrupole: 2.2640 -0.8764 -1.3876 -2.3884 0.6072 -0.0641
hfenergy: -403.9354885 hartree
pointgroup: C01 [X(C7H13N1O1)]
dipole: 0.3012272 -0.2313542 -0.0368272 debye
dipolederiv: -1.2388067 0.1951641 -0.0404266 -0.3900476 0.0008991 -0.005859 -0.0100291 0.0184307 -0.3950765 0.6731691 -0.1983926 0.0220661 0.3094096 -0.3840374 0.0331743 -0.0088479 -0.0017274 -0.1875674 0.0340597 -0.0292234 -0.0146829 -0.0556839 0.0358279 0.0068757 0.0144782 -0.0582302 0.1717405 0.0396168 -0.1085384 0.0362545 -0.0691867 -0.0757656 0.0330668 -0.0049135 0.0709169 0.1568393 0.0515845 -0.0140597 -0.0658955 -0.0707045 -0.0105683 -0.0324596 -0.0067269 -0.0406809 0.1198199 0.0360707 -0.0389555 0.0118898 0.0122497 0.0519949 -0.0456211 0.0018197 0.0155273 0.1244693 0.1519084 0.1227415 0.0018605 0.1369663 0.2457317 -0.0585932 -0.0459826 0.0149267 -0.0905141 0.0552974 0.0142877 -0.0200263 0.0445051 -0.0395335 -0.0542955 -0.0074694 -0.0343724 0.0555782 0.0172642 0.0503999 0.047844 0.0554477 0.0137301 0.0151752 0.0657407 -0.0573918 -0.0005595 -0.0251695 0.0145248 0.0273558 -0.0097603 0.0474891 0.0245756 0.0404595 0.0465075 -0.1419327 -0.0446243 -0.0390066 -0.0859294 -0.0010109 0.039819 -0.0131273 -0.0675597 -0.036755 -0.0389396 0.0853663 -0.0020995 0.0003445 0.0042789 0.0358296 0.0066684 -0.0575106 0.0330824 -0.1704404 -0.1786716 0.0306801 0.0655608 0.0104629 0.0599321 0.0015407 0.0959896 -0.0127978 0.0533733 0.0160908 -0.0056703 0.036411 -0.0079504 0.0794619 0.0112699 0.0445793 -0.0546257 -0.1890035 0.0503985 0.0063139 -0.0113356 0.0327295 -0.1902521 0.038209 -0.0216329 0.0902395 0.0579634 0.0792187 -0.0236636 0.0580337 -0.0205827 0.0514907 0.0865315 0.0142931 0.0219092 -0.1358198 -0.2004236 -0.0830978 0.0018506 -0.0439648 0.0812939 -0.0144627 0.0186843 -0.0172775 0.075856 0.0788482 0.112558 -0.0197405 0.0575715 -0.1001635 0.0156946 -0.0218924 0.0324041 0.0748722 -0.02944 -0.0212703 -0.146602 -0.0499235 0.0767857 -0.0317283 -0.0891699 -0.0110527 -0.0437942 -0.0574809 0.0462288 0.0782668 0.0898728 0.0849596 -0.0439965 0.0436264 -0.0275911 0.0700643 0.0964574 -0.0472187 0.0101274 -0.0616375 -0.1943249 0.0265948 -0.0036557 0.0127591 0.0624894 0.3092659 0.0182978 0.0067734 0.0269589 0.0894002 0.0007668 0.0057198 -0.004201 0.3705819 unknown
polarizability: 99.1059452|-4.9703046|88.3652071|-0.6149784|0.1004341|65.5206071 unknown
InChI: InChI=1S/C7H13NO/c1-5-3-4-6(2)7(5)8-9/h5-6,9H,3-4H2,1-2H3
charge 0 multiplicity 1
22 atoms
O  -2.540129 0.856156 -0.184533
N  -1.148293 1.380543 -0.188382
C  1.214778 0.691471 -0.270217
C  -0.561443 -1.111901 -0.237725
C  1.847316 -0.702645 0.006343
C  0.831318 -1.708528 -0.598018
C  -0.290739 0.392205 -0.221008
C  1.681293 1.824151 0.665508
C  -1.087367 -1.604034 1.140221
H  1.456482 0.97839 -1.316878
H  -1.332575 -1.344564 -0.996189
H  1.938213 -0.857648 1.099253
H  2.858334 -0.795783 -0.427734
H  0.954843 -1.751361 -1.697655
H  0.957289 -2.733913 -0.206628
H  1.460781 1.574569 1.719695
H  2.770773 1.986556 0.569302
H  1.162473 2.768309 0.426609
H  -0.347661 -1.421797 1.941286
H  -2.02264 -1.082456 1.402584
H  -1.288175 -2.690437 1.100635
H  -3.067869 1.695418 -0.175668
