program: Gaussian 09
title: 000231312
version: EM64L-G09RevD.01
frameworkgroup: C1[X(C12H19NO3)]
method: RPBEPBE
basis: SDD
operation: Freq
keyword: #p
keyword: freq=noraman
keyword: PBEPBE/SDD
title: #p freq=noraman PBEPBE/SDD
converged: YES YES NO NO
title: Mulliken charges:
elementType: O O O N C C C C C C C C C C C C H H H H H H H H H H H H H H H H H H H
charge: -0.284185 -0.259084 -0.248144 -0.151355 -0.009165 -0.461633 -0.400862 -0.463464 -0.400158 -0.425017 -0.289716 -0.372913 0.147961 0.254149 -0.267720 -0.659081 0.212109 0.213933 0.244173 0.223034 0.199042 0.230012 0.225084 0.204389 0.267777 0.222738 0.189426 0.283415 0.201446 0.219895 0.231458 0.223014 0.213221 0.232396 0.253824
chargesum: 0.00000
title: Mulliken charges with hydrogens summed into heavy atoms:
elementType: O O O N C C C C C C C C C C C C
charge: -0.284185 -0.259084 -0.248144 -0.151355 0.202944 -0.003526 0.021213 -0.008368 0.072008 -0.012853 -0.006300 0.048428 0.147961 0.254149 0.186752 0.040360
polarizability: 1.72411070e+02 2.78494892e+00 1.29429938e+02 6.84399478e+00 2.41003452e+00 1.19839878e+02
1716.lowfreq: -0.0009 -0.0007 -0.0005 0.5248 4.8691 18.1897 23.1497 33.0193 58.0222
frequency: 19.5829 30.4986 58.0015 68.9968 87.8844 125.5430 159.3309 188.2551 210.2571 240.5009 266.2906 277.0313 303.7926 326.2194 346.5865 394.2885 406.8441 442.8612 452.0901 474.3677 498.6786 547.9178 587.3927 630.5807 677.5913 717.2980 733.2368 807.6258 816.5952 830.3012 840.1416 853.7018 873.5286 888.9225 910.6573 933.4010 968.6168 1000.2015 1005.2505 1020.4693 1053.2426 1084.9716 1088.0639 1095.5010 1106.7028 1115.3595 1123.0334 1137.4805 1157.9255 1169.8674 1179.3452 1203.6949 1238.8503 1257.3747 1267.3278 1277.2236 1283.0809 1290.2529 1313.1517 1318.6902 1335.2767 1341.5827 1345.7867 1351.3373 1355.4551 1358.2193 1369.0261 1392.8492 1426.3953 1451.2975 1456.9810 1461.6274 1462.4079 1466.5465 1469.4655 1473.9729 1476.2233 1484.0254 1581.9499 1625.9571 2909.6600 2951.1869 2966.9840 2981.1200 2991.6635 2992.0078 2994.4022 3004.7318 3027.6373 3036.0370 3045.3948 3050.3717 3057.3217 3065.3974 3073.8119 3086.7650 3090.1911 3093.9572 3119.8519
redmass: 4.5975 4.4449 2.7348 4.0954 5.3547 3.3982 3.0394 2.3192 1.9590 2.2348 2.7821 2.1774 2.7818 3.6866 2.1485 3.4239 4.0284 2.8926 3.8425 2.9325 4.3180 2.0447 4.5896 3.2803 3.5122 4.0046 4.8446 1.3300 1.8456 2.6805 2.0314 2.5373 2.3468 2.4311 1.7542 2.3050 2.4253 2.2071 1.7466 2.2906 2.3873 1.8301 1.5562 2.2263 2.9601 2.1530 2.4865 2.3459 1.6753 1.8820 1.3558 1.4595 2.0426 1.3791 1.2768 1.1203 1.4207 1.2555 1.6023 1.3788 1.3957 1.3742 1.3784 1.4506 1.4225 1.4003 1.4304 1.2292 2.5844 1.0888 1.0975 1.0888 1.0449 1.0928 1.0851 1.0920 1.1022 1.0523 8.1201 8.0896 1.0829 1.0693 1.0637 1.0607 1.0610 1.0609 1.0363 1.0617 1.0594 1.0964 1.1032 1.1014 1.1031 1.1021 1.0853 1.0932 1.0974 1.1036 1.1055
irintensity: 2.5199 2.1558 0.5013 1.7737 1.4532 1.3297 0.7285 0.8680 3.4053 0.1440 3.5922 2.0172 2.0185 22.2172 1.2841 3.6988 0.8592 7.7939 0.1959 7.3557 3.6764 0.3643 4.4120 5.6564 0.8500 9.4673 5.9719 3.1214 0.1709 12.1375 6.9325 7.3879 4.4362 1.9223 6.3549 1.3909 16.3071 24.6437 9.3924 33.2648 9.5861 26.1216 8.3684 128.8524 263.6960 1.8484 66.8913 5.4698 20.7906 4.9863 3.4434 9.2341 35.3070 37.4291 27.6826 3.2838 15.1460 6.9495 110.7848 11.9803 2.1879 2.2849 1.6996 3.4215 10.0256 5.5598 3.2105 22.9456 53.4479 3.8253 17.4497 12.6446 13.3203 17.9417 26.3841 6.9877 11.8471 12.7995 328.5656 112.2291 42.3098 51.4291 45.1078 23.3831 47.1481 19.9415 19.1439 27.1897 33.3525 53.8124 17.2880 41.1134 54.6170 45.4018 3.9561 6.6162 33.6944 0.5828 32.7642
temp: 298.150 k
press: 1.00000 atm
elementType: 8 8 8 7 6 6 6 6 6 6 6 6 6 6 6 6 1 1 1 1 1 1 1 1 1 1 1 1 1 1 1 1 1 1 1
symmnumber: 1
zpe: 783598.0 jmol-1
zpe.correction: 0.298457 hartree
zpe.thermalcorrener: 0.314129 hartree
zpe.thermalcorrenthalpy: 0.315073 hartree
zpe.thermalcorrgfe: 0.253963 hartree
zpe.sumelectzpe: -747.873328 hartree
zpe.sumelectthermal: -747.857655 hartree
zpe.sumelectthermalent: -747.856711 hartree
zpe.sumelectthermalfe: -747.917821 hartree
dipole: 0.9357 3.5014 0.8493
dipole: 3.7225
quadrupole: -77.0812 -98.2491 -99.5589
quadrupole: -0.6329 -3.2562 -6.1237
quadrupole: 14.5485 -6.6194 -7.9292 -0.6329 -3.2562 -6.1237
hfenergy: -748.1717844 hartree
pointgroup: C01[X(C12H19N1O3)]
dipole: -0.418575 1.3923458 0.1761392 debye
polarizability: 172.6565247|-3.5299958|129.5148132|5.6294666|1.5641665|119.5095482 unknown
InChI: InChI=1S/C12H19NO3/c1-2-16-12(15)10-7-6-9-5-3-4-8-13(9)11(10)14/h9-10H,2-8H2,1H3
charge 0 multiplicity 1
35 atoms
O  0.181925 -2.054136 0.787243
O  3.205554 0.492729 0.54265
O  1.52052 0.865521 -1.027734
N  -1.379756 -0.339032 0.536188
C  -1.832688 1.08438 0.564994
C  -0.700963 2.078421 0.904299
C  -2.497108 1.44722 -0.789543
C  0.309275 1.483845 1.899099
C  -2.445137 -1.315847 0.196349
C  -3.630446 0.467582 -1.165953
C  0.946856 0.201289 1.298533
C  -3.100165 -0.984185 -1.16005
C  -0.117158 -0.817843 0.842806
C  1.873948 0.544167 0.132544
C  4.239492 0.792063 -0.500292
C  4.583482 -0.474412 -1.288333
H  -2.614287 1.143526 1.357989
H  -1.160521 2.995212 1.317211
H  -0.176319 2.363083 -0.025652
H  -1.711064 1.428216 -1.569694
H  -2.879375 2.484858 -0.726272
H  1.095133 2.219198 2.152094
H  -0.195828 1.207583 2.844984
H  -3.21564 -1.287834 0.997019
H  -1.980154 -2.314616 0.194661
H  -4.046325 0.726691 -2.157635
H  -4.460713 0.559193 -0.434539
H  1.557859 -0.314519 2.056954
H  -3.920359 -1.702799 -1.34929
H  -2.351284 -1.114388 -1.96464
H  3.850956 1.58614 -1.162193
H  5.095096 1.165061 0.085031
H  5.401832 -0.259806 -2.000608
H  4.913872 -1.280959 -0.611861
H  3.710186 -0.827703 -1.861461
