program: Gaussian 09
title: 000231310
version: EM64L-G09RevD.01
frameworkgroup: C1[X(C4H4BrN3)]
method: RPBEPBE
basis: SDD
operation: Freq
keyword: #p
keyword: freq=noraman
keyword: PBEPBE/SDD
title: #p freq=noraman PBEPBE/SDD
converged: NO NO NO NO
title: Mulliken charges:
elementType: Br N N N C C C C H H H H
charge: 0.022066 -0.060680 -0.060683 -0.584352 0.035075 -0.120848 -0.210992 -0.210990 0.258600 0.258599 0.337102 0.337102
chargesum: 0.00000
title: Mulliken charges with hydrogens summed into heavy atoms:
elementType: Br N N N C C C C
charge: 0.022066 -0.060680 -0.060683 0.089852 0.035075 -0.120848 0.047608 0.047610
polarizability: 1.38042050e+02 -1.75735073e-03 6.69029504e+01 -3.96682131e-03 1.47829262e-04 2.96383459e+01
1716.lowfreq: -13.1326 -6.0812 -0.0007 -0.0005 0.0002 15.3284 90.4017 198.1297 279.8488
frequency: 90.3931 198.1294 279.8483 281.4189 392.6855 406.2580 483.9796 525.9211 535.5854 622.6516 624.1188 787.1780 839.2835 919.8153 937.9793 954.3887 994.2651 1092.7443 1260.7252 1283.9784 1348.8815 1356.0495 1474.8688 1487.4325 1548.3285 1616.9324 3144.5909 3148.1620 3557.4454 3712.7977
redmass: 5.4614 5.9733 10.8524 13.6204 2.8611 4.1647 1.4461 1.9708 1.0259 8.4499 9.1039 11.4714 5.9460 1.5033 1.3661 8.8054 1.8121 2.7937 5.7930 1.8726 2.0229 1.8354 2.9266 6.7202 3.5986 1.6627 1.0933 1.0944 1.0447 1.1057
irintensity: 2.4194 0.3778 1.8180 3.5789 17.6926 0.0009 225.4692 109.8205 0.0009 5.8562 15.8894 22.2381 1.7695 17.8504 0.0000 23.4916 0.1612 32.4659 6.6784 13.5065 3.3727 35.3772 192.2841 56.6877 80.2645 513.0798 8.1575 9.1527 137.6789 55.1151
temp: 298.150 k
press: 1.00000 atm
elementType: 35 7 7 7 6 6 6 6 1 1 1 1
symmnumber: 1
zpe: 214770.6 jmol-1
zpe.correction: 0.081802 hartree
zpe.thermalcorrener: 0.088812 hartree
zpe.thermalcorrenthalpy: 0.089756 hartree
zpe.thermalcorrgfe: 0.049209 hartree
zpe.sumelectzpe: -331.960327 hartree
zpe.sumelectthermal: -331.953317 hartree
zpe.sumelectthermalent: -331.952373 hartree
zpe.sumelectthermalfe: -331.992920 hartree
dipole: 2.0903 0.0000 0.0079
dipole: 2.0904
quadrupole: -41.6384 -56.1501 -58.0402
quadrupole: -0.0001 0.0338 0.0000
quadrupole: 10.3045 -4.2072 -6.0973 -0.0001 0.0338 0.0000
hfenergy: -332.0421292 hartree
pointgroup: C01 [X(C4H4Br1N3)]
dipole: 0.8224027 -0.000032 0.0031077 debye
dipolederiv: -0.7432705 0.0000208 -0.0001644 0.0000375 -0.0541416 -0.0000012 0.0000229 -0.000003 -0.0106787 -1.0087711 -0.1729911 0.0002442 0.4055689 -0.3659455 -0.0003855 0.0003411 -0.0001348 -0.242918 -1.0087721 0.1730537 0.0002449 -0.405631 -0.3659211 0.000394 0.0003523 0.0001323 -0.2429157 -1.7220547 0.0000691 0.0015604 0.000039 -0.1193061 0.0000022 0.0053488 -0.0000006 -0.7196693 2.1860351 -0.0000812 -0.0016071 -0.0000308 0.1597095 -0.0000051 -0.0025234 0.0000019 0.243205 1.0018837 -0.0000443 0.0004026 -0.0000189 -0.5517553 -0.0000015 -0.0000202 0.0000033 -0.0765149 0.3321885 0.1938534 -0.0001731 0.0594734 0.4718473 0.0001359 -0.0001076 0.0000945 0.0126759 0.3321921 -0.193865 -0.0001739 -0.0595239 0.4718673 -0.0001324 -0.0001136 -0.0000925 0.01268 0.038735 0.074607 0.0000142 0.091261 -0.0027387 -0.0000199 -0.0000286 -0.0000325 0.1153294 0.0387621 -0.0746095 0.0000116 -0.0911905 -0.0027311 0.0000154 -0.0000168 0.0000314 0.1153262 0.2765301 -0.0299178 -0.0001797 -0.0785557 0.1795639 0.0003394 -0.0016182 0.00052 0.3967393 0.2765417 0.0299048 -0.0001799 0.0785709 0.1795514 -0.0003412 -0.0016368 -0.0005201 0.3967409 unknown
polarizability: 138.0420503|-0.0037279|66.9029506|-0.0039668|0.0001479|29.6383459 unknown
InChI: InChI=1S/C4H4BrN3/c5-3-1-7-4(6)8-2-3/h1-2H,6H2
charge 0 multiplicity 1
12 atoms
Br -3.259123 0.000007 -0.000746
N  0.781758 1.22887 0.000341
N  0.781682 -1.229075 0.000339
N  2.78045 -0.000167 -0.001475
C  1.410353 -0.000115 0.00022
C  -1.307654 -0.000036 -0.000245
C  -0.576741 1.211121 0.000087
C  -0.576806 -1.211244 0.000085
H  -1.081522 2.183264 0.000366
H  -1.081658 -2.183351 0.000363
H  3.279394 -0.886084 0.000732
H  3.279466 0.885711 0.000734
