program: Gaussian 09
title: 000231309
version: EM64L-G09RevD.01
frameworkgroup: C1[X(C9H11NO2)]
method: RPBEPBE
basis: SDD
operation: Freq
keyword: #p
keyword: freq=noraman
keyword: PBEPBE/SDD
title: #p freq=noraman PBEPBE/SDD
converged: YES YES NO NO
title: Mulliken charges:
elementType: O O N C C C C C C C C C H H H H H H H H H H H
charge: -0.481230 -0.297979 -0.610833 -0.182797 0.429955 -0.575380 -0.396221 -0.414706 0.282721 -0.219822 -0.231538 -0.242101 0.209914 0.231439 0.273178 0.288260 0.224292 0.224209 0.222643 0.375901 0.225935 0.341024 0.323137
chargesum: 0.00000
title: Mulliken charges with hydrogens summed into heavy atoms:
elementType: O O N C C C C C C C C C
charge: -0.105329 -0.297979 0.053327 0.027117 0.429955 -0.070763 -0.107961 -0.190414 0.282721 0.004388 -0.008895 -0.016166
polarizability: 1.42791065e+02 6.89845663e-01 1.07245465e+02 9.07866426e+00 -7.83756680e+00 6.67935062e+01
1716.lowfreq: -4.5703 -0.0005 0.0002 0.0005 2.4356 10.7320 34.7010 53.1884 83.4977
frequency: 33.9358 53.1791 83.4838 88.4615 209.1035 245.1562 258.0180 336.6194 399.5299 404.8960 462.0531 491.6362 534.2215 539.5760 585.8166 616.1452 628.6986 680.0820 686.0492 707.3274 760.1125 806.5815 853.8977 858.1687 892.1154 929.7343 980.4339 989.3966 1001.0646 1014.0170 1026.6929 1032.4321 1062.7766 1085.0072 1170.2736 1178.6358 1183.5343 1200.8985 1238.3554 1260.3896 1307.1430 1322.9364 1376.8622 1387.1760 1412.1505 1421.7920 1437.9939 1484.0061 1585.0738 1594.7425 1615.5243 1633.3687 2928.0886 2991.8733 3055.3215 3103.4401 3124.1500 3137.7462 3156.6885 3174.6209 3340.9380 3513.9721 3669.8773
redmass: 4.0870 6.2967 3.2250 4.5550 4.9751 5.0652 4.6466 5.1883 3.5533 2.9689 2.1259 2.3964 1.6678 1.9846 2.2027 6.3954 2.9458 2.1254 1.0955 1.8402 1.7825 4.1665 2.9902 1.2522 2.5201 1.5243 1.3606 6.0760 1.3572 2.7425 2.1015 4.4762 1.8786 1.7074 1.0622 1.1501 1.2663 2.2158 1.2027 1.3307 1.1711 1.2643 3.8092 6.5067 1.4969 1.1578 2.1857 2.4137 1.9661 6.2512 5.8433 2.0812 1.0835 1.0595 1.1010 1.0878 1.0864 1.0928 1.0984 1.0959 1.0654 1.0452 1.1042
irintensity: 4.6896 2.2646 2.3144 3.1901 9.0305 8.9947 1.3682 7.7869 1.9007 0.4809 2.0366 10.7184 41.3298 113.5052 90.2589 0.1281 32.6683 24.4259 196.5955 68.4863 68.9386 3.4299 3.9926 0.3385 11.2991 4.2947 0.4261 0.0890 2.5531 21.7121 9.8154 19.7182 8.7392 6.0151 0.9779 8.2687 9.8377 35.4536 1.4892 104.8786 2.7260 28.9272 147.6873 14.4264 93.4397 39.7869 13.6154 17.7214 58.8405 0.6509 3.8032 265.7911 45.8555 11.1994 14.5650 14.7548 1.2443 35.1260 29.4171 7.7888 211.7476 38.5182 27.5882
temp: 298.150 k
press: 1.00000 atm
elementType: 8 8 7 6 6 6 6 6 6 6 6 6 1 1 1 1 1 1 1 1 1 1 1
symmnumber: 1
zpe: 486545.1 jmol-1
zpe.correction: 0.185315 hartree
zpe.thermalcorrener: 0.196412 hartree
zpe.thermalcorrenthalpy: 0.197356 hartree
zpe.thermalcorrgfe: 0.147176 hartree
zpe.sumelectzpe: -553.882446 hartree
zpe.sumelectthermal: -553.871349 hartree
zpe.sumelectthermalent: -553.870405 hartree
zpe.sumelectthermalfe: -553.920586 hartree
dipole: 1.5537 -5.1289 -1.7620
dipole: 5.6413
quadrupole: -60.0610 -67.6527 -72.0432
quadrupole: -11.7408 -3.2110 -2.1382
quadrupole: 6.5246 -1.0671 -5.4575 -11.7408 -3.2110 -2.1382
hfenergy: -554.0677613 hartree
pointgroup: C01 [X(C9H11N1O2)]
dipole: -0.5961678 1.9845504 -0.7950783 debye
dipolederiv: -0.6673856 -0.0899077 -0.0942259 -0.1786219 -0.7249904 0.1041064 -0.048968 0.0891106 -0.5584576 -0.8110985 -0.1572433 0.0789471 0.1613223 -0.9268815 0.2956203 -0.0399103 0.2959465 -0.5150008 -0.7363434 0.4764841 -0.2429851 0.4140368 -0.8120268 0.0499393 -0.1680281 0.0289506 -0.6795826 0.4758241 0.0871253 0.0574482 0.1357601 0.5458052 -0.0237379 0.0847425 -0.0490688 0.4441055 0.2479797 0.008549 -0.0169478 0.0279203 -0.0647698 0.0182254 -0.0585984 0.013953 -0.0649216 -0.47448 0.0430415 -0.0052315 -0.0629735 -0.0356683 0.1227283 0.1001475 0.1364879 -0.0413531 -0.175792 0.0529607 -0.0028937 0.0722028 0.0218606 0.0389532 -0.0143293 0.0172844 -0.1178123 -0.1177377 -0.035886 -0.0621694 -0.0637922 -0.0104666 0.0808328 -0.0602745 0.0800764 -0.1163947 1.2191385 -0.2364128 0.0141903 -0.3846393 1.2855041 -0.5194701 -0.0236509 -0.4969993 0.4581347 0.0236192 -0.0693108 -0.0769026 -0.0702697 0.045499 0.0917543 -0.0605398 0.0948344 -0.0981641 -0.0163118 0.0553177 -0.0123222 0.0792405 0.0665435 0.075938 0.0013856 0.0812702 -0.1170525 0.052683 0.0425839 -0.0554037 0.0237675 -0.0876501 0.0281235 -0.049374 0.022954 -0.1485383 -0.0285218 -0.00091 0.0513105 0.0145994 -0.072097 -0.0892366 0.0178461 -0.0796863 -0.1469449 0.0581531 -0.0109346 -0.0067654 -0.0441437 -0.1382285 0.0312235 -0.0016747 0.0065643 0.0914207 0.072845 0.0133679 0.0280119 -0.0135178 0.0730255 -0.0754964 0.0113826 -0.0236735 -0.0300577 0.1436454 -0.0514751 -0.0036132 -0.0464286 0.0165196 -0.0507246 -0.0220118 -0.0411728 0.1363345 0.0138854 0.0946606 0.0826064 0.0858898 -0.0025924 -0.0779839 0.0805704 -0.0814227 0.084831 0.000667 0.077402 0.0664159 0.0885943 -0.0170804 -0.0895708 0.0786402 -0.0864025 0.1007935 0.0360644 -0.0828345 -0.0080132 -0.1021396 -0.0739631 -0.0752611 -0.0100055 -0.0753087 0.1270458 0.4540923 -0.1192864 0.1046879 -0.0573919 0.4065425 -0.0811339 0.0649688 -0.069198 0.3716484 -0.1319328 -0.0425232 0.0562069 -0.0451388 0.0915289 -0.0182893 0.0575174 -0.0170469 0.1405462 0.1626755 -0.015458 0.015538 0.0154099 0.2097256 0.082556 0.0253824 0.0772393 0.3450113 0.198331 -0.0393104 0.0321106 -0.0496868 0.2038604 0.0809037 0.0347816 0.075308 0.3344086 unknown
polarizability: 143.1040501|0.1605133|107.8710145|-7.6634657|5.9829049|65.8549719 unknown
InChI: InChI=1S/C9H11NO2/c10-9(12)6-8(11)7-4-2-1-3-5-7/h1-5,8,11H,6,10H2
charge 0 multiplicity 1
23 atoms
O  -0.915763 -1.800875 0.410681
O  -3.470522 -0.843643 0.238612
N  -3.824628 1.229825 -0.719024
C  -0.634152 -0.371799 0.491213
C  0.851345 -0.143014 0.234763
C  -1.49749 0.401726 -0.555656
C  1.63971 -1.144233 -0.380428
C  1.450917 1.092061 0.587959
C  -2.996305 0.207497 -0.308394
C  3.007827 -0.907761 -0.647277
C  2.817412 1.329752 0.319809
C  3.600531 0.329269 -0.303024
H  -0.894379 0.015602 1.50249
H  -1.231342 1.475165 -0.558123
H  -1.251053 -0.003382 -1.556968
H  1.168145 -2.101647 -0.619259
H  0.8547 1.866732 1.089038
H  3.61288 -1.691053 -1.118389
H  3.27208 2.286094 0.602794
H  -1.913085 -1.885362 0.486507
H  4.661954 0.50945 -0.508362
H  -4.832969 1.118015 -0.606398
H  -3.461712 2.078778 -1.148767
