program: Gaussian 09
title: 000231308
version: EM64L-G09RevD.01
frameworkgroup: C1[X(C10H11NO2)]
method: RPBEPBE
basis: SDD
operation: Freq
keyword: #p
keyword: freq=noraman
keyword: PBEPBE/SDD
title: #p freq=noraman PBEPBE/SDD
converged: YES YES NO NO
title: Mulliken charges:
elementType: O O N C C C C C C C C C C H H H H H H H H H H H
charge: -0.278745 -0.226044 -0.408320 0.178976 -0.419470 0.397332 -0.704323 0.212298 -0.385181 -0.394595 -0.239543 -0.214289 -0.239093 0.232752 0.249696 0.233655 0.254566 0.218843 0.332913 0.223357 0.286292 0.227235 0.230542 0.231146
chargesum: 0.00000
title: Mulliken charges with hydrogens summed into heavy atoms:
elementType: O O N C C C C C C C C C C
charge: -0.278745 -0.226044 -0.075407 0.178976 0.062979 0.397332 0.002741 0.212298 -0.161825 -0.108303 -0.012309 0.016253 -0.007947
polarizability: 1.49866762e+02 3.45105868e+00 1.17191256e+02 4.41735302e+00 6.88701198e+00 7.28330522e+01
1716.lowfreq: -10.3655 -2.1564 -0.0008 -0.0005 0.0002 9.5773 28.8819 57.9288 114.8352
frequency: 27.8950 57.8991 114.8194 151.5312 185.1734 240.0027 287.8424 293.7688 313.3007 369.9076 401.2863 446.9851 503.6444 529.5100 551.6116 614.8842 641.2687 686.5389 687.6411 708.3964 761.1333 771.0304 847.0737 857.5083 895.7361 909.8959 927.6037 933.9532 981.2993 989.5761 1002.5223 1025.6336 1055.5994 1069.7387 1089.7319 1116.5998 1139.5688 1173.2885 1189.6221 1201.8473 1206.9226 1277.1530 1315.6867 1319.3401 1380.0386 1383.4725 1394.0579 1434.5048 1457.9819 1467.2235 1485.1137 1498.2840 1591.8384 1615.2162 1735.4876 2984.4993 2990.3147 3049.1255 3087.3387 3107.6238 3111.5954 3129.7601 3142.8325 3160.5355 3177.2371 3615.8422
redmass: 3.8346 5.7318 4.1039 4.1223 4.3346 1.0442 3.7128 2.9727 3.9067 4.3339 2.8532 4.0422 1.1420 4.5411 3.1647 6.4166 5.9360 7.3207 9.7109 1.7459 5.8960 1.8937 3.9993 1.2559 3.8395 2.9339 1.4822 1.5152 1.3675 6.2547 1.3174 2.3674 2.3074 1.7248 1.7351 1.9993 2.3052 1.0519 1.1255 1.8172 3.0219 2.8603 1.5134 1.4252 6.6632 1.3366 1.5283 2.2287 1.0697 1.0767 2.1557 1.0908 6.2381 6.0970 10.0815 1.0594 1.0362 1.1055 1.1003 1.0992 1.0885 1.0869 1.0930 1.0982 1.0964 1.0795
irintensity: 2.5989 0.1824 2.7092 1.4307 2.9985 0.0640 0.6519 0.4049 4.6765 6.4724 0.0234 7.6078 136.7614 4.2879 16.2909 0.3083 2.3280 15.6304 11.7064 60.0779 11.4689 44.0331 36.5336 0.3565 80.2675 27.6990 13.2738 2.2685 0.4649 0.2251 1.0339 23.1046 106.9944 26.0171 13.5934 25.5817 6.5494 0.5483 3.7564 31.7832 96.5720 76.9817 8.6859 5.1769 1.4064 14.6159 11.2954 11.9399 4.9095 4.9389 13.1678 12.0434 1.0098 4.1194 592.3204 42.9783 12.3163 25.9381 29.7277 7.1023 16.8955 1.6788 29.0182 24.2295 6.5203 47.6264
temp: 298.150 k
press: 1.00000 atm
elementType: 8 8 7 6 6 6 6 6 6 6 6 6 6 1 1 1 1 1 1 1 1 1 1 1
symmnumber: 1
zpe: 501665.3 jmol-1
zpe.correction: 0.191074 hartree
zpe.thermalcorrener: 0.202418 hartree
zpe.thermalcorrenthalpy: 0.203363 hartree
zpe.thermalcorrgfe: 0.152997 hartree
zpe.sumelectzpe: -591.929006 hartree
zpe.sumelectthermal: -591.917662 hartree
zpe.sumelectthermalent: -591.916717 hartree
zpe.sumelectthermalfe: -591.967083 hartree
dipole: -2.8915 -4.6341 -1.6231
dipole: 5.6982
quadrupole: -81.2818 -73.3152 -75.3532
quadrupole: -13.4847 -3.5154 1.7110
quadrupole: -4.6318 3.3349 1.2969 -13.4847 -3.5154 1.7110
hfenergy: -592.12008 hartree
pointgroup: C01 [X(C10H11N1O2)]
dipole: 1.1432561 -1.8252552 0.622331 debye
dipolederiv: -1.4077134 0.2733362 0.3504625 0.1728802 -0.4764151 -0.0444001 0.3983417 -0.0698907 -0.5226205 -1.1078285 0.4951236 0.0275103 0.5169993 -0.8072299 0.0838847 0.064455 0.0586501 -0.4274091 -0.5888778 0.0570228 -0.0977636 0.0917182 -0.8860999 0.21272 -0.0043028 0.1412833 -0.5653351 0.7026261 -0.0480057 -0.0784427 -0.3485007 0.3901723 0.2148046 0.0355271 0.091515 0.3734041 0.3346943 -0.1816103 0.1870229 -0.0883601 0.2472677 0.0801564 0.034301 0.1553001 0.1110649 0.1883309 0.0706275 0.0567389 0.1251091 -0.0441554 -0.027406 0.0410699 -0.0106936 -0.1062272 -0.1090192 -0.0452704 -0.0370338 0.0341496 -0.0304523 -0.0736785 0.0202479 -0.0756159 -0.0969903 1.942787 -0.7264546 -0.3410574 -0.5809903 1.3586431 -0.4913909 -0.5182222 -0.3413123 0.8037249 -0.138488 0.0319817 0.0144487 0.0047226 0.0490243 -0.0149072 0.0068075 -0.0243745 -0.1465192 -0.123528 -0.0917108 0.0174185 -0.0755734 -0.0298212 -0.0184668 0.0129611 -0.028243 -0.1133902 0.0165479 -0.0655648 0.0467957 -0.0918861 0.0443356 -0.0462434 0.0473132 -0.0312714 -0.1370987 -0.0222845 0.0638609 0.0125274 0.0578964 0.1356103 -0.0305704 0.0125943 -0.0224485 -0.1346007 0.0657282 0.0366744 0.0406175 0.0558189 -0.0680224 -0.0043677 0.0342824 -0.0068628 -0.1545302 0.0240788 0.0171107 -0.0213831 0.0284039 -0.1490996 -0.0136749 -0.0108008 -0.0548461 0.0947581 -0.0373583 0.0729389 -0.1061579 0.0151211 0.0452687 -0.0422951 -0.1301036 -0.0252413 -0.0947321 -0.1414718 -0.0833438 -0.0483857 -0.0809223 0.0664635 -0.0257828 -0.0411373 -0.0187631 0.0731401 0.1022814 -0.033228 0.0532117 -0.0274818 0.0371501 0.0962439 0.053353 0.0499106 -0.0275072 0.0300456 0.1182612 0.0011052 0.134378 -0.0441995 -0.018602 0.0127926 0.0350643 0.0695432 0.1828976 0.0782641 0.0480596 0.0867985 0.2485231 0.0675193 0.059371 0.0791675 0.2797066 0.0736777 -0.0899236 -0.0015254 -0.0878324 -0.0939134 0.0141129 -0.0044778 0.0116719 0.13275 0.1024099 0.0701892 -0.0304988 0.0824178 0.0480992 0.0163251 -0.0228257 0.0228332 0.1425151 -0.0225164 0.0895195 -0.0415435 0.1058877 -0.0213037 0.0432612 -0.0483113 0.0404005 0.1433405 0.0518776 -0.0577165 -0.0090266 -0.0773849 -0.0992262 0.0216502 -0.0068716 0.0230695 0.1494385 -0.1188972 -0.0520822 -0.0431008 -0.0533692 0.0793805 0.0011075 -0.0463646 0.0006972 0.1535745 unknown
polarizability: 149.8993487|-3.4155777|117.2785504|4.269761|-6.524008|72.713171 unknown
InChI: InChI=1S/C10H11NO2/c1-10(7-11-9(12)13-10)8-5-3-2-4-6-8/h2-6,11H,7H2,1H3
charge 0 multiplicity 1
24 atoms
O  -1.460859 0.720091 -0.516247
O  -3.615038 1.400501 0.14286
N  -2.611224 -0.60894 0.920528
C  -0.638271 -0.532429 -0.364189
C  -1.292359 -1.247071 0.876978
C  0.81945 -0.141347 -0.129713
C  -0.824024 -1.34575 -1.661091
C  -2.685875 0.576317 0.199535
C  1.770318 -1.147816 0.181307
C  1.245383 1.204261 -0.231982
C  3.125644 -0.812587 0.392025
C  2.603434 1.537678 -0.023595
C  3.547438 0.533605 0.288797
H  -1.364942 -2.336723 0.711692
H  -0.707993 -1.060036 1.798158
H  -1.881526 -1.642196 -1.780964
H  -0.528596 -0.733644 -2.529056
H  -0.197278 -2.255197 -1.645966
H  -3.359145 -0.875346 1.556705
H  1.458849 -2.19745 0.26149
H  0.508142 1.976315 -0.468286
H  3.849728 -1.598478 0.634355
H  2.922335 2.58283 -0.104868
H  4.59901 0.795113 0.450725
