program: Gaussian 09
title: 000231307
version: EM64L-G09RevD.01
frameworkgroup: C1[X(C14H9NO6)]
method: RPBEPBE
basis: SDD
operation: Freq
keyword: #p
keyword: freq=noraman
keyword: PBEPBE/SDD
title: #p freq=noraman PBEPBE/SDD
converged: YES YES NO NO
title: Mulliken charges:
elementType: O O O O O O N C C C C C C C C C C C C C C H H H H H H H H H
charge: -0.290040 -0.169077 -0.429021 -0.244708 -0.209274 -0.213059 0.022830 0.264578 0.120285 0.417530 -0.367761 0.085761 -0.314933 -0.253413 -0.363356 0.386182 -0.215346 -0.213586 -0.363505 -0.334739 0.119905 0.266547 0.281079 0.292732 0.265311 0.245245 0.244128 0.287884 0.289160 0.392661
chargesum: 0.00000
title: Mulliken charges with hydrogens summed into heavy atoms:
elementType: O O O O O O N C C C C C C C C C C C C C C
charge: -0.290040 -0.169077 -0.036360 -0.244708 -0.209274 -0.213059 0.022830 0.264578 0.120285 0.417530 -0.101214 0.085761 -0.033854 0.039319 -0.098045 0.386182 0.029899 0.030542 -0.075622 -0.045579 0.119905
polarizability: 2.98702002e+02 -2.04827074e+01 1.47692577e+02 -1.23361122e+01 7.33693019e+00 1.28635259e+02
1716.lowfreq: -0.0010 -0.0009 -0.0007 2.0567 3.0425 3.8692 20.2904 32.1746 34.2096
frequency: 20.2745 32.1620 34.1976 54.9620 72.8548 92.7797 106.7578 127.2349 143.5434 173.2563 221.5592 233.8638 243.4621 304.8811 343.0396 367.6792 376.2256 408.7543 409.5656 414.0363 491.3774 503.8028 510.7931 534.1051 593.9700 598.7797 615.4476 622.0272 657.0417 666.5185 671.4808 697.6444 721.3630 744.4767 754.2809 783.3229 793.4421 797.7827 826.6886 834.5360 866.9849 905.5644 978.7081 981.2702 985.3548 987.7095 1001.9425 1008.9770 1015.6245 1045.5624 1092.9437 1105.4590 1107.9017 1158.2453 1164.3363 1180.4582 1190.6758 1218.1014 1228.8126 1280.8734 1290.5068 1328.3071 1361.0281 1384.6734 1407.5247 1423.9689 1431.5260 1472.5224 1479.2909 1580.6155 1596.1931 1602.7164 1606.2124 1633.3136 1656.8294 3143.4670 3156.5509 3170.5228 3170.8274 3181.9044 3183.8458 3191.1024 3205.3496 3529.5344
redmass: 6.4981 7.6256 8.3238 10.2256 6.5731 9.2974 5.9613 7.6947 6.8624 9.8897 7.7454 6.1489 6.8307 7.6112 10.0444 7.8373 6.9676 7.1891 3.3884 2.9881 3.6082 5.5391 6.0283 5.4904 2.2102 1.8403 6.8810 6.6173 6.3692 4.9663 5.2437 4.1178 5.2368 5.1131 5.8134 3.5519 1.9534 4.8030 4.7216 1.3264 1.7769 1.4558 1.4072 1.4314 6.0161 1.3708 2.9489 1.3754 4.9828 2.2273 3.2206 1.9028 1.2716 1.7876 1.7342 1.0738 2.1893 4.4232 4.1978 1.5233 1.2724 2.7012 8.4313 10.8627 11.2281 3.8968 2.2173 2.4048 2.7128 7.1675 7.2321 6.5716 7.0102 8.7624 12.7550 1.0866 1.0915 1.0968 1.0896 1.0903 1.0981 1.0968 1.0966 1.0643
irintensity: 0.0322 0.0299 0.5046 0.9728 0.1373 2.9825 1.5899 1.4613 2.4284 2.9504 1.6654 2.4011 3.3474 0.6474 5.5478 7.6688 2.3398 11.0638 6.6517 0.3048 13.5757 13.4220 5.5330 5.1733 67.8638 62.7210 2.1943 3.2585 39.1817 27.2799 10.5648 98.3546 34.0266 33.5892 3.8462 18.7253 25.7073 2.5348 29.8097 0.3489 69.2433 0.3291 7.5360 57.4871 483.2636 1.9132 20.6477 8.0821 220.4337 66.5754 19.1413 105.0438 25.8106 405.2936 68.4142 1.2500 180.4905 422.6351 20.3993 19.2060 1.4568 96.3440 94.5393 11.0557 10.9130 39.8758 10.5564 59.7339 24.6863 37.3306 66.6410 46.2900 57.7163 254.0346 164.1507 1.3962 7.4500 9.7341 1.1928 0.6114 9.1504 2.2564 2.1141 55.1431
temp: 298.150 k
press: 1.00000 atm
elementType: 8 8 8 8 8 8 7 6 6 6 6 6 6 6 6 6 6 6 6 6 6 1 1 1 1 1 1 1 1 1
symmnumber: 1
zpe: 540076.9 jmol-1
zpe.correction: 0.205704 hartree
zpe.thermalcorrener: 0.223443 hartree
zpe.thermalcorrenthalpy: 0.224387 hartree
zpe.thermalcorrgfe: 0.157311 hartree
zpe.sumelectzpe: -1043.444632 hartree
zpe.sumelectthermal: -1043.426893 hartree
zpe.sumelectthermalent: -1043.425949 hartree
zpe.sumelectthermalfe: -1043.493025 hartree
dipole: 8.7970 0.2791 -2.2710
dipole: 9.0897
quadrupole: -135.1557 -106.1566 -122.6410
quadrupole: -0.2136 -1.7923 2.9863
quadrupole: -13.8379 15.1612 -1.3232 -0.2136 -1.7923 2.9863
hfenergy: -1043.6503363 hartree
pointgroup: C01 [X(C14H9N1O6)]
dipole: -3.456062 -0.4373233 0.8083381 debye
polarizability: 294.7841032|33.652137|154.2330798|-1.3722991|0.5989297|126.0126553 unknown
InChI: InChI=1S/C14H9NO6/c16-13(17)11-3-1-2-4-12(11)14(18)21-10-7-5-9(6-8-10)15(19)20/h1-8,16H
charge 0 multiplicity 1
30 atoms
O  -0.252044 -0.674462 0.273351
O  -0.634203 -0.848507 -2.044428
O  -2.954438 2.36855 1.500833
O  -1.310082 1.921089 -0.072229
O  5.744153 1.380812 -0.580991
O  6.043247 -0.159705 1.075213
N  5.299152 0.485627 0.237826
C  -2.517302 -0.736968 -0.485409
C  -3.119044 0.313318 0.266712
C  1.133297 -0.388554 0.17696
C  -3.291852 -1.853831 -0.87197
C  -1.07312 -0.716754 -0.888907
C  -4.473874 0.2013 0.665777
C  1.637901 0.598254 -0.702473
C  1.969744 -1.08376 1.078432
C  3.850611 0.181727 0.217558
C  -4.64433 -1.953677 -0.476618
C  -5.231853 -0.931917 0.303931
C  3.014628 0.881976 -0.681746
C  3.34595 -0.797053 1.103142
C  -2.356293 1.566787 0.524211
H  -2.827934 -2.644813 -1.469493
H  -4.921661 1.016149 1.240549
H  0.96567 1.13395 -1.374633
H  1.532023 -1.832358 1.744385
H  -5.233902 -2.826673 -0.77498
H  -6.278564 -1.010225 0.614759
H  3.450202 1.636685 -1.341203
H  4.0283 -1.311523 1.784017
H  -2.422686 3.202456 1.608527
