program: Gaussian 09
title: 000231304
version: EM64L-G09RevD.01
frameworkgroup: C1[X(C13H16N4O2S)]
method: RPBEPBE
basis: SDD
operation: Freq
keyword: #p
keyword: freq=noraman
keyword: PBEPBE/SDD
title: #p freq=noraman PBEPBE/SDD
converged: YES YES NO NO
title: Mulliken charges:
elementType: S O O N N N N C C C C C C C C C C C C C H H H H H H H H H H H H H H H H
charge: 0.987067 -0.545540 -0.494188 -0.610739 -0.073155 -0.043654 -0.688414 -0.480859 -0.357970 -0.091398 0.286432 0.057084 -0.225671 -0.144702 -0.682891 -0.347784 0.516719 -0.391510 -0.410718 -0.263423 0.201596 0.223632 0.230303 0.204823 0.358220 0.284442 0.285673 0.209528 0.214704 0.222173 0.240667 0.230648 0.229411 0.240680 0.314336 0.314478
chargesum: 0.00000
title: Mulliken charges with hydrogens summed into heavy atoms:
elementType: S O O N N N N C C C C C C C C C C C C C
charge: 0.987067 -0.545540 -0.494188 -0.252519 -0.073155 -0.043654 -0.059600 -0.055631 0.077156 -0.091398 0.286432 0.057084 0.058771 0.140971 -0.036485 -0.107117 0.516719 -0.160862 -0.181308 -0.022743
polarizability: 2.78187196e+02 -2.05904823e+01 1.90667833e+02 -1.69615882e+01 -2.20293240e+01 1.71049589e+02
1716.lowfreq: -7.0988 -4.2535 0.0007 0.0009 0.0016 6.7546 13.9579 21.9605 30.3113
frequency: 13.9548 21.8669 30.2451 49.6863 70.9784 76.7986 92.0283 98.9585 134.8748 151.0380 178.1817 209.9311 229.7626 235.9143 243.1077 265.2012 292.2857 309.2547 326.2994 355.0331 402.9330 408.7241 410.5270 412.8116 428.2972 445.9499 454.8086 519.5670 532.6044 569.7882 600.4097 621.8645 625.5770 668.1253 702.5169 720.8143 744.9520 784.4233 793.4711 801.5215 809.8094 817.0367 833.1226 835.5856 869.2868 891.1673 923.5282 945.3191 951.2149 964.5116 972.1252 979.9780 981.4848 1021.5500 1052.4780 1053.7878 1069.1474 1090.7173 1103.6004 1132.2138 1184.5175 1208.5058 1214.2933 1245.2176 1276.0710 1280.7118 1301.6976 1302.8667 1318.7498 1322.9726 1335.7169 1390.1058 1401.1501 1416.4273 1430.7823 1436.1540 1459.6237 1475.9412 1478.1708 1486.2560 1490.3120 1534.3692 1542.5423 1586.6690 1614.2225 1647.1191 2974.7128 2984.3829 2995.7182 3034.3563 3059.3967 3076.0175 3078.0657 3134.4961 3136.2707 3136.9315 3164.9879 3177.2798 3181.9585 3504.6938 3562.8111 3701.9766
redmass: 5.2662 3.2409 4.2209 3.9680 5.4429 2.0567 5.2306 4.5362 7.4450 5.2808 6.1738 7.6712 5.9974 1.3724 3.9960 4.4679 5.3765 4.1524 5.6975 3.1798 3.2435 3.6387 1.2078 2.7006 1.4857 4.8830 3.4908 2.6180 1.5994 4.4603 6.1055 7.1679 7.4388 5.4757 2.6819 2.9042 1.1246 5.7500 3.1740 5.5688 1.3233 7.8785 1.8235 1.6270 1.3872 1.9346 4.8562 1.4234 7.8071 1.3869 1.4276 4.0587 4.9591 1.4461 2.5032 2.9360 1.7122 2.0471 1.4511 1.1956 1.1162 2.4056 1.5049 1.9331 1.6002 1.3817 1.5183 1.3003 1.9118 2.5402 1.5207 1.2104 5.7551 2.3570 5.9467 3.7453 1.1111 1.0549 1.0434 1.0808 2.9221 5.7571 5.9816 7.4338 4.7476 1.2296 1.0355 1.0607 1.0596 1.0987 1.1025 1.0998 1.1019 1.0898 1.0906 1.0899 1.0958 1.0966 1.0950 1.0771 1.0452 1.1040
irintensity: 1.7993 0.3699 0.2945 0.7869 0.1147 0.5566 0.4563 0.5725 0.5474 3.8725 2.3641 0.7699 10.9730 1.4055 1.3878 0.2487 24.7900 3.4603 10.4054 3.8965 5.3665 22.5870 5.3931 0.4346 199.2747 314.9828 40.3469 38.3524 55.4699 6.5225 8.6386 13.7909 33.0020 8.9901 243.2408 16.3497 10.2289 4.8498 2.0153 46.5024 1.2737 90.5208 77.7569 39.7496 4.5930 2.4540 3.4335 2.1216 64.4368 1.2481 0.2699 26.0659 14.2968 1.4358 58.1288 3.2598 6.9967 33.9929 2.5595 12.6169 55.2582 5.3165 8.6065 15.5423 8.4377 10.6632 16.4877 6.5521 9.4835 72.0924 19.8839 6.6796 2.6073 48.3234 643.6955 1.7272 2.3656 2.4978 9.0702 18.9572 72.8979 216.3174 261.5426 12.5702 166.6036 268.2491 45.5197 7.4579 46.4781 0.1724 0.6373 50.9367 69.7065 12.3097 14.0939 18.1898 6.9596 12.6584 5.6353 71.5801 111.8866 24.9927
temp: 298.150 k
press: 1.00000 atm
elementType: 16 8 8 7 7 7 7 6 6 6 6 6 6 6 6 6 6 6 6 6 1 1 1 1 1 1 1 1 1 1 1 1 1 1 1 1
symmnumber: 1
zpe: 727437.0 jmol-1
zpe.correction: 0.277066 hartree
zpe.thermalcorrener: 0.297353 hartree
zpe.thermalcorrenthalpy: 0.298297 hartree
zpe.thermalcorrgfe: 0.225394 hartree
zpe.sumelectzpe: -1270.862415 hartree
zpe.sumelectthermal: -1270.842128 hartree
zpe.sumelectthermalent: -1270.841184 hartree
zpe.sumelectthermalfe: -1270.914087 hartree
dipole: 1.0527 -8.1889 -1.1650
dipole: 8.3381
quadrupole: -87.7675 -128.2638 -122.1652
quadrupole: -21.8358 -9.7001 -6.6215
quadrupole: 24.9647 -15.5317 -9.4330 -21.8358 -9.7001 -6.6215
hfenergy: -1271.1394807 hartree
pointgroup: C01 [X(C13H16N4O2S1)]
dipole: 0.562502 -2.6583663 -1.8379828 debye
polarizability: 258.4828159|46.6528342|176.6067365|11.1985293|20.46833|204.8150659 unknown
InChI: InChI=1S/C13H16N4O2S/c1-2-3-11-8-9-15-13(16-11)17-20(18,19)12-6-4-10(14)5-7-12/h4-9,17H,2-3,14H2,1H3
charge 0 multiplicity 1
36 atoms
S  -1.854784 0.857337 0.93489
O  -2.483177 0.814622 2.436331
O  -1.906912 2.206969 0.042609
N  -0.088363 0.403782 1.324808
N  2.209108 0.616989 0.985557
N  0.66971 0.439304 -0.916108
N  -4.218022 -3.743729 -2.189797
C  4.648651 0.728316 0.760788
C  5.078027 -0.626093 1.394133
C  -2.53083 -0.574182 -0.03789
C  3.276643 0.651067 0.12957
C  0.963374 0.501464 0.42408
C  -3.176414 -1.600092 0.676278
C  -2.427606 -0.559856 -1.440333
C  6.450095 -0.529171 2.09272
C  3.076855 0.602277 -1.27566
C  -3.657902 -2.692531 -1.474915
C  -3.740625 -2.662923 -0.048388
C  -2.997441 -1.623993 -2.157638
C  1.748704 0.502594 -1.745264
H  5.39531 1.039126 0.005977
H  4.630032 1.496054 1.557214
H  4.30031 -0.93233 2.118719
H  5.108911 -1.405885 0.607589
H  0.118613 0.551505 2.320912
H  -3.250788 -1.549833 1.767202
H  -1.90579 0.25898 -1.942536
H  7.244463 -0.239388 1.379127
H  6.430295 0.226684 2.900029
H  6.73693 -1.497067 2.542484
H  3.919574 0.648819 -1.969538
H  -4.252819 -3.472078 0.484549
H  -2.932471 -1.636188 -3.251614
H  1.528971 0.470021 -2.818218
H  -4.694014 -4.504536 -1.713421
H  -4.171612 -3.768633 -3.204445
