program: Gaussian 09
title: 000231279
version: EM64L-G09RevD.01
frameworkgroup: C1[X(C7H10N2O3)]
method: RPBEPBE
basis: SDD
operation: Freq
keyword: #p
keyword: freq=noraman
keyword: PBEPBE/SDD
title: #p freq=noraman PBEPBE/SDD
converged: YES YES NO NO
title: Mulliken charges:
elementType: O O O N N C C C C C C C H H H H H H H H H H
charge: -0.226763 -0.215482 -0.231364 -0.190331 -0.371817 0.033483 0.220564 0.156269 -0.689863 -0.688658 0.198142 -0.590841 0.251448 0.220784 0.252005 0.251937 0.220979 0.251944 0.367744 0.267695 0.260248 0.251877
chargesum: 0.00000
title: Mulliken charges with hydrogens summed into heavy atoms:
elementType: O O O N N C C C C C C C
charge: -0.226763 -0.215482 -0.231364 -0.190331 -0.004073 0.033483 0.220564 0.156269 0.034373 0.036203 0.198142 0.188979
polarizability: 1.20483763e+02 4.04766476e+00 1.02876505e+02 -5.92581631e-01 4.22378886e-01 6.56229509e+01
1716.lowfreq: -77.9873 -13.7186 -2.0607 -0.0004 -0.0002 0.0003 4.4274 22.3132 80.9052
frequency: -77.9822 21.5002 80.8922 151.4044 205.9562 223.4664 246.7583 259.8130 280.3021 295.1636 306.7339 340.5495 365.7847 395.0188 432.7012 468.7836 573.4170 670.2301 673.9915 698.7183 713.7863 723.6825 786.4276 825.1442 893.4646 952.0636 962.2297 1017.5995 1051.5285 1112.6873 1128.5155 1156.9573 1179.5432 1212.2072 1268.4672 1320.8211 1357.7003 1369.4548 1376.2622 1394.8538 1426.4616 1460.4450 1467.1341 1468.8703 1476.1702 1489.5355 1490.8444 1591.7753 1647.2661 1658.5504 2996.6408 2997.3506 3018.2454 3095.5530 3099.8005 3115.3063 3119.3522 3123.0699 3151.2559 3515.7351
redmass: 1.0440 4.7221 4.4540 10.1847 1.5748 2.5208 1.9609 1.0930 3.0010 2.5387 4.2626 3.4584 9.2585 7.3082 8.2749 5.0938 8.1912 4.1799 2.5121 6.5215 9.5954 6.0167 1.7543 2.6925 2.6647 1.5493 2.1556 1.2999 2.5056 3.5457 1.4094 3.3987 2.6658 2.6259 4.0524 3.8833 5.0013 1.1603 1.6671 1.3438 1.2519 1.0517 1.0934 1.0455 1.0601 1.0646 1.0743 10.1527 5.7668 8.5550 1.0345 1.0351 1.0349 1.0999 1.0991 1.0994 1.1028 1.1020 1.1035 1.0767
irintensity: 0.0637 3.0148 1.3636 12.2288 0.0176 0.0276 0.0160 1.5071 8.1982 4.8224 5.3403 2.0329 31.1621 19.3191 8.5091 13.0269 1.6991 4.7672 15.7261 3.2967 4.9958 0.0997 117.7809 0.2192 1.0567 4.3366 2.4028 0.0558 45.7708 0.1457 4.0210 9.6894 40.4895 21.8687 108.7928 225.5406 186.9151 12.4807 13.6769 65.8268 141.8992 11.7055 18.5761 0.2403 27.3442 18.1029 13.1147 377.2005 385.9517 153.2384 21.7554 9.1635 20.0234 14.5145 21.8587 11.9206 0.1932 9.0256 0.2583 61.1645
temp: 298.150 k
press: 1.00000 atm
elementType: 8 8 8 7 7 6 6 6 6 6 6 6 1 1 1 1 1 1 1 1 1 1
symmnumber: 1
zpe: 448025.1 jmol-1
zpe.correction: 0.170644 hartree
zpe.thermalcorrener: 0.181979 hartree
zpe.thermalcorrenthalpy: 0.182923 hartree
zpe.thermalcorrgfe: 0.133064 hartree
zpe.sumelectzpe: -607.057868 hartree
zpe.sumelectthermal: -607.046533 hartree
zpe.sumelectthermalent: -607.045589 hartree
zpe.sumelectthermalfe: -607.095448 hartree
dipole: 0.1312 -0.8161 0.0650
dipole: 0.8291
quadrupole: -76.1114 -80.1996 -67.5260
quadrupole: -0.2680 -0.0062 -0.1166
quadrupole: -1.4991 -5.5873 7.0863 -0.2680 -0.0062 -0.1166
hfenergy: -607.2285117 hartree
pointgroup: C01 [X(C7H10N2O3)]
dipole: 0.0533828 0.3159125 -0.0612596 debye
dipolederiv: -0.5613547 -0.0145455 -0.0440462 0.1613038 -1.04829 0.1276394 -0.0572256 0.0853938 -0.3658794 -0.9290268 -0.2290006 -0.0780364 -0.3570409 -0.7458084 -0.0109034 -0.0558486 0.0171429 -0.3651492 -1.0676133 0.2769301 -0.1754851 0.2548489 -0.7434172 0.1005437 -0.1718838 0.1138024 -0.4084784 -0.9169292 0.4877605 -0.2244288 0.1778851 -1.3114705 0.1833667 -0.136529 0.2653502 -0.2389908 -1.5278653 -0.3715424 -0.1867284 -0.0281086 -0.5143867 0.0249185 -0.2302504 -0.0433269 -0.3447278 -0.2191265 0.0125214 -0.0453836 0.0360999 -0.2176625 0.0364673 -0.057173 0.036894 -0.0259937 1.1802307 -0.4609094 0.2728257 -0.2878472 1.1736019 -0.185785 0.2426974 -0.2169188 0.226638 1.574856 0.2300035 0.2380037 -0.119271 0.8994928 -0.1345148 0.2857907 -0.0675545 0.2392525 0.0398436 -0.0428966 0.0136803 -0.0558733 -0.0179792 -0.0035807 -0.0601374 0.0292064 0.063922 0.0199984 -0.0360792 -0.0209388 -0.0436894 -0.0239071 0.0115747 0.0599689 -0.0178255 0.0900763 1.6629486 -0.0170969 0.269165 0.0769471 1.8291362 -0.1994648 0.2481595 -0.2230572 0.3859679 0.2730589 0.1379074 0.0260672 0.1904912 0.1428779 0.0710692 0.010084 0.061994 0.1926076 -0.0537351 -0.0525029 0.0028065 -0.0914329 0.0725004 -0.0228724 -0.019434 -0.0254895 0.0872911 0.0587214 0.0185461 -0.0824767 0.020734 0.0893359 0.0297443 -0.0331667 0.005912 -0.1250637 0.1038171 0.0214112 0.0184441 0.0602596 -0.0656771 0.0188972 0.0005267 0.0426194 0.0807817 0.1110842 0.0236298 -0.0153744 0.0531473 -0.0661951 0.0476061 -0.0067332 0.0107472 0.072093 -0.0068408 0.059183 0.1181414 0.056827 0.0676191 -0.0621623 0.0689133 -0.0384895 -0.0369809 -0.0464414 -0.0654694 -0.0403737 -0.0913807 0.077309 -0.0118239 -0.0094838 0.0031652 0.0738845 0.1275368 -0.0049007 -0.0393574 -0.0145068 0.2292961 0.0142591 -0.0388055 0.0140873 0.3301388 0.1498986 0.0561679 -0.0401021 -0.0522776 0.0138011 0.0537789 -0.0054691 0.0596242 0.0790339 -0.002432 0.0095946 0.0358937 0.0965068 0.0761474 -0.0705315 0.0263932 -0.0518662 0.0838011 0.0293709 -0.0387121 -0.002296 -0.0436223 0.0836763 -0.0182264 -0.0603937 -0.0614108 -0.0942242 unknown
polarizability: 118.4016476|-2.3934129|102.0307291|11.0841432|-5.2201161|68.5508414 unknown
InChI: InChI=1S/C7H10N2O3/c1-7(2)4(10)8-6(12)9(3)5(7)11/h8H,1-3H3
charge 0 multiplicity 1
22 atoms
O  0.120766 2.394901 -0.399847
O  -1.996058 -1.977221 -0.191139
O  2.540305 -1.473289 0.599507
N  1.340673 0.476903 0.082436
N  0.259284 -1.652833 0.191739
C  -1.163688 0.324705 -0.374533
C  0.131708 1.146571 -0.23241
C  -1.023936 -1.181507 -0.124207
C  -2.206948 0.889229 0.641041
C  -1.699856 0.524494 -1.828275
C  1.452641 -0.913706 0.309211
C  2.585318 1.276298 0.209379
H  -3.159608 0.348777 0.517029
H  -1.867705 0.766761 1.685368
H  -2.356655 1.963236 0.444351
H  -1.856481 1.600258 -2.009926
H  -0.989961 0.139556 -2.582337
H  -2.654079 -0.016547 -1.937471
H  0.357627 -2.659873 0.359933
H  2.436077 2.222724 -0.32918
H  3.424413 0.704682 -0.213257
H  2.797965 1.489678 1.270585
